program: Gaussian 09
title: 000126866
version: EM64L-G09RevD.01
frameworkgroup: C1[X(C7H10N6O3)]
method: RPBEPBE
basis: SDD
operation: Freq
keyword: #p
keyword: freq=noraman
keyword: PBEPBE/SDD
title: #p freq=noraman PBEPBE/SDD
converged: YES YES NO NO
title: Mulliken charges:
elementType: O O O N N N N N N C C C C C C C H H H H H H H H H H
charge: -0.245949 -0.251106 -0.219462 -0.163905 -0.129862 -0.109553 -0.137720 0.037788 0.069637 0.217672 0.169873 -0.223438 0.236846 -0.608767 -0.637240 -0.621423 0.269926 0.227489 0.249790 0.286146 0.260175 0.255613 0.273576 0.272079 0.253448 0.268365
chargesum: 0.00000
title: Mulliken charges with hydrogens summed into heavy atoms:
elementType: O O O N N N N N N C C C C C C C
charge: -0.245949 -0.251106 -0.219462 -0.163905 -0.129862 -0.109553 -0.137720 0.037788 0.069637 0.217672 0.169873 0.046488 0.236846 0.154659 0.152124 0.172469
polarizability: 1.75823450e+02 -2.84308954e+00 1.45662770e+02 2.01473800e+00 1.19953001e+01 9.42812806e+01
1716.lowfreq: 0.0005 0.0006 0.0009 2.9693 5.4527 7.4939 38.8889 47.1299 63.0236
frequency: 38.8727 47.1117 63.0092 83.3614 93.6671 101.0992 106.2337 116.8514 121.9234 162.0704 210.7228 232.2583 254.4119 283.8381 310.3571 319.5372 354.1979 371.4477 381.8800 383.7650 423.3378 450.8847 494.0308 566.8687 616.3857 675.8270 725.6977 743.9219 763.3696 785.4845 807.1889 853.7637 887.5931 934.8590 980.3566 1056.8165 1112.1084 1114.3494 1125.3316 1133.8477 1146.0915 1168.8013 1187.2266 1243.7393 1296.1111 1325.1907 1346.8196 1356.3541 1363.5508 1395.9901 1411.3610 1413.8079 1431.2025 1456.3286 1457.6372 1459.8834 1468.0961 1470.4026 1480.1686 1495.8983 1538.1810 1583.8596 3004.7469 3008.4655 3010.9173 3094.0167 3096.0948 3106.6646 3132.7924 3149.0861 3150.1492 3241.0827
redmass: 4.2158 6.7851 4.1553 1.8834 3.6666 1.3315 1.9593 1.3798 2.2260 5.2930 5.3282 4.5375 6.9128 4.9867 3.1176 3.5842 7.3304 6.2274 7.2182 5.3294 6.2426 7.2086 7.4377 6.7479 4.2544 7.7615 7.6132 8.2851 6.2744 5.5481 1.4482 4.4881 3.5929 5.0561 5.6243 1.7194 1.3914 1.3516 1.3262 3.2025 2.6741 2.6414 2.4705 2.4190 6.4108 4.7194 7.1802 7.6107 9.6698 2.5494 1.4545 1.2317 1.6979 1.0693 1.0569 1.0487 1.1912 1.1384 1.8474 1.1251 5.9590 10.3179 1.0340 1.0336 1.0344 1.0997 1.1009 1.1007 1.1029 1.1022 1.1012 1.0992
irintensity: 0.5518 1.6481 6.3967 10.5865 1.2763 0.1242 3.8081 0.3663 0.3240 4.7568 10.6720 5.7158 10.4624 1.8575 2.7945 3.4576 1.1878 6.0222 3.4009 6.0457 2.1757 3.7829 6.2826 7.5052 19.0893 7.9164 1.4732 11.4264 77.6969 32.8888 20.1070 42.4177 102.9077 215.2897 76.4411 11.2108 4.2156 0.6483 2.7084 48.0926 46.5533 46.1505 1.7835 49.1259 47.1255 30.7726 43.8390 131.8953 133.6416 67.6346 1.8427 71.5001 41.3032 32.0669 19.9394 22.2038 28.0318 54.6718 63.4226 2.7774 26.8372 295.8311 13.4459 9.0782 31.7661 9.9969 8.8704 14.0224 3.5515 0.0256 0.1679 1.4068
temp: 298.150 k
press: 1.00000 atm
elementType: 8 8 8 7 7 7 7 7 7 6 6 6 6 6 6 6 1 1 1 1 1 1 1 1 1 1
symmnumber: 1
zpe: 489149.2 jmol-1
zpe.correction: 0.186307 hartree
zpe.thermalcorrener: 0.202967 hartree
zpe.thermalcorrenthalpy: 0.203911 hartree
zpe.thermalcorrgfe: 0.141131 hartree
zpe.sumelectzpe: -825.591619 hartree
zpe.sumelectthermal: -825.574959 hartree
zpe.sumelectthermalent: -825.574015 hartree
zpe.sumelectthermalfe: -825.636795 hartree
dipole: 4.9400 -0.8843 1.1162
dipole: 5.1412
quadrupole: -84.8375 -87.5175 -100.9824
quadrupole: 0.6796 3.4498 0.8544
quadrupole: 6.2750 3.5949 -9.8699 0.6796 3.4498 0.8544
hfenergy: -825.7779256 hartree
pointgroup: C01 [X(C7H10N6O3)]
dipole: -0.353063 1.9914681 -0.0265861 debye
dipolederiv: -0.8681819 0.0274921 0.2646753 0.0283001 -0.5664198 -0.2385733 0.2613713 -0.3168597 -0.7880944 -0.2981363 0.4036994 -0.0989749 0.2001359 -1.2698831 0.3485331 0.070338 -0.1409258 -0.1706844 -0.2269467 -0.1912267 -0.2790733 -0.1832275 -0.5744534 -0.6926686 -0.0419527 -0.2130778 -0.6192795 -0.3175444 0.301969 0.0951756 0.4449061 -0.383988 -0.0645524 0.2691181 -0.1355268 -0.1517848 -0.1945995 -0.2475443 0.115998 0.3033722 -0.8920575 0.1195443 -0.1110397 0.5040775 -0.2038414 -0.3982761 0.0012297 0.0421129 0.0578478 -0.7382047 -0.0277496 0.0382234 0.0415261 -0.2465439 -0.2259239 -0.0101447 0.1649666 -0.2957361 -0.5996649 -0.4738909 -0.279105 -0.7180757 -0.9921673 -0.078806 0.1358958 -0.0603143 -0.1741874 1.4647606 -0.5458391 0.0131068 -0.4124509 0.1041847 -0.1422709 -0.1243494 -0.1548663 0.1316534 0.3322935 0.7277968 0.1054084 0.6440037 1.1543884 -0.842306 -0.2091335 0.1474488 -0.5107854 0.1129574 0.0649981 0.1818491 0.0854731 -0.0702131 0.5172266 -0.0376814 0.0373437 -0.38582 0.868021 0.0185059 -0.1240444 -0.1467747 0.0526179 0.2642459 -0.2418106 -0.1726718 -0.1422826 0.1985847 0.0303775 -0.1391139 0.0775158 -0.010783 1.5393532 0.3904262 -0.0866696 0.6738793 1.1109388 0.6848583 -0.115838 0.6486705 0.9941097 0.2901627 -0.2067567 -0.0084261 -0.1438505 0.3328536 0.0360592 -0.0167256 0.0740439 0.1658475 0.2417817 -0.0746701 -0.0137218 -0.0191844 0.0604345 0.0392976 0.0334775 0.0952528 0.1600679 0.2404054 0.065805 0.0589469 -0.0359438 0.1101245 -0.0194976 -0.0130616 -0.0919136 0.0574986 0.1161506 0.0128328 0.0210631 0.0002022 -0.0121919 -0.002435 0.0095266 -0.0099507 0.1742517 0.0418857 -0.1269416 0.0040099 -0.0170562 -0.0918228 -0.0155173 0.0176185 0.0375257 0.1314127 -0.0485319 0.0801981 -0.0638482 -0.0074692 0.0695392 -0.0488757 -0.1001953 -0.0164889 0.00134 0.0547578 0.0741493 0.041241 0.0046989 0.1272491 0.0734049 0.0513686 -0.0119731 -0.0028046 0.0210636 -0.047155 -0.060232 0.0047324 0.044949 -0.0906514 0.0057139 -0.0556079 -0.0210449 0.0354924 0.0157462 -0.0030736 0.112201 0.0394434 0.039046 -0.0788697 0.0589035 0.0299062 0.12517 -0.0526479 0.0252292 -0.0980864 0.0661424 0.0501107 0.0128645 0.0243431 0.1144367 0.0258729 0.0827744 -0.0102937 0.0128988 -0.0205142 0.0364171 0.0153437 -0.0048975 0.1004213 -0.0120629 -0.025404 -0.0289226 -0.0225701 0.0841124 0.0199955 -0.1227121 -0.0054842 0.0073934 0.1400178 0.003248 0.022877 0.0613718 0.1267962 -0.0686941 0.0573298 -0.0113284 0.0293645 unknown
polarizability: 140.1132039|1.5222521|173.9490801|-19.865581|12.3427429|101.7052172 unknown
InChI: InChI=1S/C7H10N6O3/c1-11-4-8-6(12(2)9-15)5(11)7(14)13(3)10-16/h4H,1-3H3
charge 0 multiplicity 1
26 atoms
O  -2.019753 0.689085 1.7003
O  1.516682 -2.929688 0.485583
O  -1.640089 -2.029405 -1.937822
N  0.032765 2.368188 0.345175
N  1.68565 -0.797248 -0.202285
N  2.04316 1.593528 -0.368118
N  -1.746696 -0.851691 -0.029353
N  1.05235 -1.742736 0.620188
N  -1.199617 -1.001384 -1.325666
C  -0.083594 0.960006 0.293251
C  1.196209 0.518675 -0.125938
C  1.303564 2.689691 -0.087689
C  -1.316608 0.285171 0.726941
C  -1.022691 3.32772 0.715121
C  2.829878 -1.15918 -1.060902
C  -2.728662 -1.810521 0.503848
H  1.647947 3.71592 -0.190177
H  -0.599829 4.343962 0.674343
H  -1.870331 3.262265 0.011851
H  -1.390528 3.111767 1.729061
H  2.477784 -1.740137 -1.931684
H  3.529218 -1.78825 -0.485765
H  3.315779 -0.228571 -1.384556
H  -2.252291 -2.800346 0.6122
H  -3.579247 -1.906979 -0.191576
H  -3.069852 -1.433444 1.47787
