program: Gaussian 09
title: 000126856
version: EM64L-G09RevD.01
frameworkgroup: C1[X(C6H16FN2OP)]
method: RPBEPBE
basis: SDD
operation: Freq
keyword: #p
keyword: freq=noraman
keyword: PBEPBE/SDD
title: #p freq=noraman PBEPBE/SDD
converged: YES YES NO NO
title: Mulliken charges:
elementType: P F O N N C C C C C C H H H H H H H H H H H H H H H H
charge: 1.296322 -0.411105 -0.587849 -0.493894 -0.085114 -0.820667 -0.288156 -0.586011 -0.558493 -0.617274 -0.614313 0.301585 0.282170 0.242228 0.217097 0.235662 0.237583 0.237968 0.227442 0.258156 0.228880 0.194361 0.225545 0.232645 0.224678 0.225983 0.194573
chargesum: 0.00000
title: Mulliken charges with hydrogens summed into heavy atoms:
elementType: P F O N N C C C C C C
charge: 1.296322 -0.411105 -0.587849 -0.493894 -0.085114 -0.236912 0.171169 0.125201 0.155985 0.035276 0.030921
polarizability: 1.23086634e+02 -2.82247260e-01 1.04877466e+02 7.60713220e-01 4.01129305e+00 8.85879082e+01
1716.lowfreq: -14.0183 -4.6437 -0.0015 -0.0006 0.0007 7.0969 30.7317 44.5965 47.9018
frequency: 29.4826 44.4854 47.7950 87.3238 109.4940 129.5789 180.1027 193.6185 200.6672 208.7833 231.7157 236.1022 256.8872 260.1265 294.9168 341.4186 356.2054 370.2552 411.9665 429.2442 461.5044 586.0527 645.6103 758.2788 784.5761 827.3783 954.5400 1004.6569 1013.0489 1032.3655 1049.1257 1060.3003 1060.6335 1088.3457 1090.8845 1124.3104 1130.9081 1154.8092 1184.6291 1210.4850 1260.6597 1263.1722 1277.4535 1302.7819 1374.9857 1419.8263 1422.6367 1434.9905 1444.8329 1452.0445 1461.6382 1463.2717 1469.3604 1474.5292 1478.2305 1480.4064 1483.6248 1488.6855 1496.7997 2861.1849 2870.9403 2889.9151 2943.9739 2954.0710 3023.4211 3025.6386 3032.7374 3033.0625 3038.4856 3040.3188 3080.4035 3082.4038 3086.3531 3096.2359 3107.9481
redmass: 2.8491 2.6645 3.7555 4.2406 2.3785 2.6731 1.1411 2.6231 1.4946 2.9147 1.4454 1.5656 1.6270 2.5515 5.0122 2.9190 3.2512 3.4995 3.1349 2.9913 3.5594 4.7972 6.9645 4.5975 1.5557 3.1196 2.9556 1.5195 2.9288 1.5995 7.7550 1.6512 2.0715 1.2194 1.3116 1.2754 1.3500 1.6277 4.7694 1.6931 2.3545 2.1711 1.5489 1.1882 1.3041 1.1361 1.1162 1.1087 1.1654 1.1260 1.0479 1.0490 1.0531 1.0477 1.0481 1.0491 1.0688 1.0648 1.0512 1.0559 1.0578 1.0682 1.0408 1.0397 1.0739 1.0622 1.0781 1.0872 1.0869 1.0973 1.1013 1.0994 1.1006 1.1024 1.0981
irintensity: 1.7891 1.8577 2.0940 1.0647 1.5766 3.3205 0.8188 3.0158 1.7922 2.5134 0.6733 6.9554 9.1024 7.9084 11.9108 19.7140 6.5073 5.0593 14.6544 7.7645 37.8715 26.5223 70.3664 43.1524 9.5434 39.2572 142.1126 18.3259 29.9241 23.7770 92.1405 29.2713 24.6614 0.7000 5.3550 8.0064 0.5105 14.1349 43.6432 21.8354 1.6401 15.7444 22.8758 8.3326 3.1023 6.4134 2.0501 13.3728 2.4038 0.4901 6.4032 14.3635 3.1244 30.7374 13.5299 36.8912 5.3516 20.7044 7.1779 65.6848 127.3979 102.3777 63.3257 93.0402 39.0596 6.9421 59.4773 27.0934 10.7984 20.3552 16.5565 38.6965 44.1692 4.6334 7.7477
temp: 298.150 k
press: 1.00000 atm
elementType: 15 9 8 7 7 6 6 6 6 6 6 1 1 1 1 1 1 1 1 1 1 1 1 1 1 1 1
symmnumber: 1
zpe: 590713.8 jmol-1
zpe.correction: 0.224991 hartree
zpe.thermalcorrener: 0.240182 hartree
zpe.thermalcorrenthalpy: 0.241127 hartree
zpe.thermalcorrgfe: 0.181947 hartree
zpe.sumelectzpe: -863.074715 hartree
zpe.sumelectthermal: -863.059523 hartree
zpe.sumelectthermalent: -863.058579 hartree
zpe.sumelectthermalfe: -863.117759 hartree
dipole: 2.9885 4.1847 -0.2489
dipole: 5.1483
quadrupole: -73.5642 -78.0025 -79.6821
quadrupole: -13.1427 -0.3663 -0.8835
quadrupole: 3.5188 -0.9196 -2.5992 -13.1427 -0.3663 -0.8835
hfenergy: -863.2997055 hartree
pointgroup: C01 [X(C6H16F1N2O1P1)]
dipole: -1.1339283 1.6756996 0.0942012 debye
polarizability: 123.0936935|-0.1845309|104.8366939|0.5366172|-4.1043877|88.6216207 unknown
InChI: InChI=1S/C6H16FN2OP/c1-8(2)5-6-11(7,10)9(3)4/h5-6H2,1-4H3
charge 0 multiplicity 1
27 atoms
P  1.388483 -0.863112 0.148688
F  1.30748 -1.22912 -1.570596
O  2.292549 -1.943569 0.88791
N  1.921599 0.793639 0.012851
N  -2.632699 0.25769 0.242323
C  -0.421316 -0.831901 0.604246
C  -1.283274 0.040118 -0.331663
C  1.705086 1.717247 1.14665
C  3.126484 1.076713 -0.799314
C  -3.456221 -0.970708 0.274175
C  -3.339057 1.370229 -0.430069
H  -0.72602 -1.893076 0.584876
H  -0.511375 -0.476166 1.645828
H  -0.804468 1.028863 -0.454376
H  -1.319079 -0.429805 -1.345594
H  1.671013 2.751047 0.755842
H  2.511267 1.658807 1.908413
H  0.739428 1.517267 1.642824
H  3.030194 2.089529 -1.232979
H  3.19667 0.354122 -1.627981
H  4.06071 1.03162 -0.202147
H  -3.642655 -1.398718 -0.743307
H  -4.433073 -0.743485 0.735748
H  -2.971563 -1.747234 0.890497
H  -2.731455 2.290532 -0.367478
H  -4.299046 1.560436 0.081967
H  -3.557663 1.171036 -1.509333
