program: Gaussian 09
title: 000126880
version: EM64L-G09RevD.01
frameworkgroup: C1[X(C16H23NO3S2)]
method: RPBEPBE
basis: SDD
operation: Freq
keyword: #p
keyword: freq=noraman
keyword: PBEPBE/SDD
title: #p freq=noraman PBEPBE/SDD
converged: YES YES NO NO
title: Mulliken charges:
elementType: S S O O O N C C C C C C C C C C C C C C C C H H H H H H H H H H H H H H H H H H H H H H H
charge: -0.004798 0.179151 -0.266842 -0.447971 -0.213860 -0.415065 -0.230597 -0.554778 -0.131551 0.266208 0.360157 -0.739626 -0.349920 0.279001 -0.715773 -0.403335 0.130968 -0.410896 -0.846601 -0.249785 -0.239681 -0.837197 0.251115 0.199405 0.270298 0.302739 0.256279 0.270715 0.343978 0.282546 0.244010 0.277581 0.248871 0.273413 0.225835 0.232286 0.235591 0.221486 0.225811 0.224154 0.098858 0.393020 0.253246 0.259108 0.252443
chargesum: 0.00000
title: Mulliken charges with hydrogens summed into heavy atoms:
elementType: S S O O O N C C C C C C C C C C C C C C C C
charge: 0.094060 0.179151 -0.266842 -0.054950 -0.213860 -0.071086 0.020518 -0.085075 0.171188 0.266208 0.360157 -0.212631 0.176637 0.279001 -0.189321 -0.129922 0.130968 -0.185061 -0.157237 -0.023974 -0.015526 -0.072400
polarizability: 2.57375986e+02 2.13047739e+01 2.11213768e+02 -1.86699373e+01 1.37177924e+01 1.87236118e+02
1716.lowfreq: -1.3777 -0.0023 -0.0013 0.0007 6.9011 13.1612 18.3158 23.7668 27.3644
frequency: 17.6776 23.3110 25.5444 34.0211 41.6339 46.4752 55.3790 61.4503 70.3626 90.7809 99.2450 102.0034 127.0733 132.7772 143.1252 161.6936 180.3877 187.8530 212.7113 214.0840 246.1217 262.1819 276.4306 290.6720 322.1562 347.4132 382.9221 395.6786 415.2122 455.5512 463.2743 513.2946 527.6403 540.7225 569.2726 577.7777 594.3981 610.8656 618.2021 648.8197 652.8684 686.2453 711.2317 735.6738 738.1903 751.6289 764.3752 773.5541 811.6110 824.2746 877.5088 878.6865 889.0242 897.7413 904.2394 939.8281 954.5762 958.0949 961.9647 984.4220 992.0781 1007.7182 1021.0918 1041.5540 1044.9145 1060.3995 1072.2806 1086.0352 1103.9986 1116.1545 1163.2429 1173.8832 1178.9487 1189.1183 1197.5896 1212.5765 1218.1564 1219.1627 1237.4697 1267.0036 1281.8571 1288.5678 1298.1244 1298.6744 1319.6040 1332.5548 1337.9639 1341.5520 1351.8119 1377.8310 1399.5452 1434.1943 1438.5352 1448.0661 1448.7798 1458.9912 1461.3693 1467.4574 1470.8104 1473.9522 1479.1602 1488.8183 1588.3788 1606.8544 1615.4471 1674.0139 2434.3824 2964.2370 2966.8961 2999.9408 3000.9897 3003.4278 3010.2862 3013.2840 3024.3100 3038.5664 3072.3898 3078.2747 3080.2028 3084.3700 3100.8348 3112.5986 3115.6068 3128.0546 3128.7133 3142.9175 3159.5859 3526.6926 3546.5510
redmass: 5.6196 3.6141 6.8127 5.5133 5.0241 9.6680 5.6313 5.5341 4.0835 6.0618 3.4237 1.8567 2.0054 4.5129 1.1207 4.0866 2.9094 1.1293 4.1449 2.8984 4.1292 3.3584 3.5911 4.4251 3.8315 2.7027 4.2116 3.4117 2.7588 3.2084 3.2505 3.7847 3.5395 4.2724 3.5580 1.2274 4.3419 4.6358 1.8254 4.6827 4.0728 4.2773 3.6057 2.9378 2.3978 2.1131 1.5654 1.8012 4.0030 2.7727 1.8126 1.3995 2.9561 1.5575 2.6174 2.3529 1.3388 1.4594 1.3126 1.5891 1.3329 2.0777 1.8338 1.6401 2.0663 3.0281 2.0676 1.9493 2.1099 2.6547 1.1314 1.0826 1.1521 1.8205 1.8551 1.4043 1.5467 1.2898 2.4001 1.2869 1.4459 1.2296 1.2533 1.4101 1.5973 1.4086 1.5926 1.2008 1.3560 5.1759 1.2527 1.9389 1.0877 1.0599 1.0929 1.0674 1.1745 1.0815 1.0731 1.9405 1.4027 1.7856 6.4430 7.2081 6.2488 9.1165 1.0385 1.0815 1.0381 1.0715 1.0513 1.0466 1.0619 1.0577 1.0623 1.0969 1.1009 1.1006 1.0980 1.1080 1.1047 1.0869 1.1054 1.0883 1.1026 1.0939 1.1006 1.0644 1.0781
irintensity: 0.2290 1.3873 0.4598 0.1989 1.4620 3.0036 0.8125 1.0735 1.5099 2.9830 4.6016 2.7907 0.0289 0.6704 0.4933 1.2646 5.6532 20.7202 1.1727 0.9022 11.0663 1.9063 6.1155 2.4059 2.0427 2.6493 5.7603 12.1771 9.4866 15.4680 7.9140 8.2917 50.1785 6.7155 5.2592 76.7442 12.7732 3.0424 111.2774 3.2374 23.8250 31.1572 4.6345 12.2382 3.3248 26.2414 26.7863 28.2947 2.5360 1.9716 4.3740 5.3322 30.7426 3.7165 22.4854 5.2006 33.7037 3.0629 16.2035 2.2516 0.9774 33.3862 10.1735 8.2450 9.9782 71.7410 4.2076 103.8775 13.7716 10.3887 1.9848 2.1950 10.7774 3.6354 29.4664 12.8505 16.2902 1.3244 0.1440 16.4878 4.1159 4.3149 22.9062 2.3231 34.7532 5.1320 2.5574 1.9068 2.7812 1.0964 12.0956 3.7166 0.4359 24.9549 11.1927 8.7895 20.7306 30.6536 7.2872 385.8037 14.9708 20.7663 0.5697 106.4965 2.7828 207.6876 31.9959 7.4211 34.0847 1.4257 42.0978 22.3791 29.0926 30.0068 17.0364 24.9626 5.3191 1.5522 33.6040 22.1970 9.4442 10.9178 22.3318 12.1458 12.0395 22.2458 28.9347 34.4917 51.9155
temp: 298.150 k
press: 1.00000 atm
elementType: 16 16 8 8 8 7 6 6 6 6 6 6 6 6 6 6 6 6 6 6 6 6 1 1 1 1 1 1 1 1 1 1 1 1 1 1 1 1 1 1 1 1 1 1 1
symmnumber: 1
zpe: 946852.3 jmol-1
zpe.correction: 0.360637 hartree
zpe.thermalcorrener: 0.385989 hartree
zpe.thermalcorrenthalpy: 0.386934 hartree
zpe.thermalcorrgfe: 0.301007 hartree
zpe.sumelectzpe: -1698.378644 hartree
zpe.sumelectthermal: -1698.353291 hartree
zpe.sumelectthermalent: -1698.352347 hartree
zpe.sumelectthermalfe: -1698.438274 hartree
dipole: -0.1963 -0.9038 5.7989
dipole: 5.8722
quadrupole: -145.6974 -148.3511 -139.9889
quadrupole: -3.4954 -2.0531 3.4220
quadrupole: -1.0182 -3.6720 4.6902 -3.4954 -2.0531 3.4220
hfenergy: -1698.7392805 hartree
pointgroup: C01 [X(C16H23N1O3S2)]
dipole: -0.0588771 0.3387234 -2.2845919 debye
polarizability: 256.0032251|-22.4549066|212.6617944|19.4851514|12.8963318|187.1608531 unknown
InChI: InChI=1S/C16H23NO3S2/c1-11-5-3-4-6-12(11)9-13(10-21)15(18)17-14(16(19)20)7-8-22-2/h3-6,13-14,17,19,21H,7-10H2,1-2H3
charge 0 multiplicity 1
45 atoms
S  0.695995 -3.400112 0.070189
S  5.347524 -1.649843 0.435305
O  0.168745 -0.22174 1.481029
O  2.285648 2.091575 -2.165383
O  3.619701 3.071836 -0.534539
N  1.079841 0.429165 -0.543919
C  -0.859144 -1.108248 -0.601264
C  -2.075009 -1.514298 0.283113
C  2.148914 1.201927 0.102909
C  0.154169 -0.263892 0.212697
C  -3.11008 -0.401981 0.409992
C  -0.153724 -2.3238 -1.255103
C  3.274115 0.301302 0.720416
C  -4.148463 -0.242814 -0.560145
C  3.964784 -0.601456 -0.313283
C  -3.037169 0.502195 1.500384
C  2.762741 2.221505 -0.846693
C  -5.074426 0.819675 -0.405158
C  -4.294007 -1.19745 -1.736194
C  -3.965973 1.557066 1.641113
C  -4.990853 1.717942 0.682492
C  6.646872 -0.311721 0.702753
H  -1.22575 -0.481426 -1.441908
H  -2.530614 -2.421367 -0.154889
H  -1.68922 -1.787862 1.280096
H  1.706702 1.763011 0.95043
H  0.619916 -1.996431 -1.97107
H  -0.89953 -2.943605 -1.780832
H  1.015874 0.463148 -1.563303
H  2.804563 -0.317744 1.503303
H  4.003129 0.975263 1.206054
H  3.25408 -1.340268 -0.721278
H  4.401656 -0.023821 -1.149057
H  -2.232415 0.372143 2.232608
H  -5.875095 0.94009 -1.145608
H  -5.125274 -0.888474 -2.392957
H  -4.502634 -2.231245 -1.398788
H  -3.378179 -1.241763 -2.356625
H  -3.891356 2.243303 2.49219
H  -5.720298 2.530078 0.780691
H  1.136513 -4.369728 -0.818101
H  2.718973 2.773229 -2.745974
H  6.854123 0.211625 -0.244901
H  6.326481 0.406027 1.473658
H  7.556853 -0.831117 1.041849
