program: Gaussian 09
title: 000126860
version: EM64L-G09RevD.01
frameworkgroup: C1[X(C12H24N4O3)]
method: RPBEPBE
basis: SDD
operation: Freq
keyword: #p
keyword: freq=noraman
keyword: PBEPBE/SDD
title: #p freq=noraman PBEPBE/SDD
converged: YES YES NO NO
title: Mulliken charges:
elementType: O O O N N N N C C C C C C C C C C C C H H H H H H H H H H H H H H H H H H H H H H H H
charge: -0.272758 -0.475458 -0.232475 -0.343691 -0.148140 -0.657438 -0.697504 -0.391700 -0.348217 -0.546755 -0.382592 -0.375456 -0.402889 -0.363356 0.219044 -0.449703 -0.519531 0.211501 0.245168 0.203572 0.190587 0.227276 0.192565 0.237857 0.217665 0.173594 0.206127 0.237827 0.199625 0.254126 0.205166 0.213687 0.203689 0.300180 0.211637 0.181117 0.330687 0.237161 0.380015 0.333218 0.305866 0.401113 0.287591
chargesum: 0.00000
title: Mulliken charges with hydrogens summed into heavy atoms:
elementType: O O O N N N N C C C C C C C C C C C C
charge: -0.272758 -0.095442 -0.232475 -0.043511 -0.148140 -0.018355 -0.008800 0.002459 0.071624 -0.091233 -0.002871 0.061997 0.056403 0.054020 0.219044 -0.056949 0.048317 0.211501 0.245168
polarizability: 1.87581769e+02 2.45951256e+00 1.71624314e+02 -1.24972126e+01 1.31292414e+00 1.47644282e+02
1716.lowfreq: -7.6002 -1.1517 -0.0008 -0.0007 -0.0006 9.1042 28.0024 31.3236 37.8703
frequency: 27.9368 31.2500 37.8651 47.5876 70.0877 74.8183 86.3631 102.4996 105.9708 120.3038 124.4112 132.6735 150.4186 166.3955 202.5437 214.5044 226.0199 251.9198 291.2943 294.0443 307.9233 369.3623 392.6336 404.3407 408.9441 433.9756 454.0575 463.4023 496.6838 499.3071 508.8455 555.3011 563.2470 579.5663 606.0763 621.1335 661.0630 679.2443 730.3290 739.9718 740.1277 786.6610 818.5259 843.0389 849.7373 857.3264 896.1140 908.3107 912.5079 957.9482 980.9459 991.8857 1021.1789 1033.2117 1039.7797 1055.6212 1077.0996 1082.8392 1085.9369 1093.8288 1104.5683 1115.0784 1141.1579 1166.8181 1172.6742 1186.1033 1218.5561 1225.7650 1244.7529 1260.5830 1268.4939 1276.1878 1287.7406 1291.0154 1296.0836 1306.0435 1310.9921 1344.8196 1349.3065 1350.7279 1361.6747 1365.4162 1385.2072 1415.7405 1445.8559 1450.9001 1454.5732 1454.9864 1458.4629 1462.2303 1467.2745 1478.7803 1480.4997 1488.1013 1608.6404 1615.1218 1615.7794 1661.6089 1681.6360 2862.8551 2875.1922 2918.2548 2956.9667 2968.9625 2974.3321 2978.5294 2984.4298 2990.3111 3004.9198 3006.9472 3013.5080 3024.0238 3031.5781 3050.6813 3054.3420 3077.8474 3078.8799 3444.6568 3522.5877 3553.3396 3555.9020 3636.4974 3701.3792
redmass: 6.5335 4.2778 4.8940 6.9116 4.6802 5.7540 4.4960 4.1720 4.6103 2.1077 2.1085 4.0275 2.9972 2.5377 3.2086 3.4577 3.1408 4.3800 3.8743 2.3710 2.2110 1.2354 2.5204 2.9096 1.2029 1.2388 2.6390 2.6784 2.2380 2.0605 2.0331 1.4152 3.0852 4.4685 2.6812 1.4550 4.5783 2.3042 1.2710 1.2521 1.2581 2.0011 1.9441 2.1311 4.1107 1.9086 2.2019 2.0245 2.5652 2.0259 2.5185 2.6054 2.7676 1.8355 1.5512 2.1357 2.6467 2.2946 2.1796 2.5007 2.2584 2.5994 1.4850 1.5353 1.6463 1.2789 1.3496 1.3223 1.5671 1.6991 1.2760 1.2193 1.2449 1.2215 1.0870 1.1667 1.3089 1.4032 1.4025 1.3824 1.3543 1.5634 1.7179 3.9593 1.1672 1.0974 1.0909 1.0893 1.0901 1.0802 1.0777 1.0969 1.0992 1.7498 1.7053 1.7982 2.9135 1.8051 7.6125 1.0601 1.0742 1.0956 1.0611 1.0620 1.0646 1.0611 1.0604 1.0656 1.0649 1.0950 1.0873 1.0976 1.0955 1.1026 1.1021 1.1027 1.0984 1.0531 1.0639 1.0777 1.0451 1.0972 1.1033
irintensity: 1.4925 1.1091 2.0968 8.7679 2.9270 1.9167 4.6440 3.9296 2.9841 3.5998 0.8739 4.9570 2.5090 2.2912 5.0729 4.7693 5.6056 3.1627 5.6355 4.9048 6.9271 136.0776 6.3707 28.9668 252.2338 27.7703 7.1034 29.3779 9.3986 39.6566 28.5854 115.7980 14.6833 16.4171 14.6010 103.5773 1.1098 4.3996 22.0275 109.3086 41.3837 19.2610 3.7810 1.3161 7.1643 1.5025 1.1597 0.3939 4.4024 15.0212 14.7588 4.7707 241.2649 24.6021 19.3737 2.1608 0.3399 4.5041 0.9276 26.0301 11.6042 15.4592 17.8525 6.3947 5.7743 7.2782 12.7243 1.9007 3.5837 39.0671 2.5765 6.2211 9.0847 10.3546 0.8634 14.5587 6.1426 3.8817 4.2631 40.5807 15.7209 3.8470 40.1529 144.8707 46.9307 6.0205 7.1252 6.8344 28.3088 2.9286 0.0410 16.2758 20.1757 153.6715 119.6307 114.3080 247.2027 420.9156 206.6193 116.5275 93.0312 49.5066 11.6124 20.1654 84.8952 6.0064 38.1355 40.3964 42.7222 23.2010 5.4042 10.0532 14.7877 135.2028 39.0393 6.5350 33.1984 259.0282 23.3873 10.4822 19.1293 72.5838 20.2440
temp: 298.150 k
press: 1.00000 atm
elementType: 8 8 8 7 7 7 7 6 6 6 6 6 6 6 6 6 6 6 6 1 1 1 1 1 1 1 1 1 1 1 1 1 1 1 1 1 1 1 1 1 1 1 1
symmnumber: 1
zpe: 961820.4 jmol-1
zpe.correction: 0.366338 hartree
zpe.thermalcorrener: 0.388479 hartree
zpe.thermalcorrenthalpy: 0.389423 hartree
zpe.thermalcorrgfe: 0.313762 hartree
zpe.sumelectzpe: -914.862173 hartree
zpe.sumelectthermal: -914.840033 hartree
zpe.sumelectthermalent: -914.839089 hartree
zpe.sumelectthermalfe: -914.914750 hartree
dipole: 3.9768 -0.5574 0.5548
dipole: 4.0538
quadrupole: -99.9249 -105.8602 -121.8997
quadrupole: -10.5995 -19.6145 -7.2523
quadrupole: 9.3034 3.3680 -12.6714 -10.5995 -19.6145 -7.2523
hfenergy: -915.2285115 hartree
pointgroup: C01 [X(C12H24N4O3)]
dipole: -1.5850562 0.0032141 0.1767774 debye
polarizability: 186.0014646|3.1939746|172.2533372|13.9191408|2.4778498|148.5955626 unknown
InChI: InChI=1S/C12H24N4O3/c13-12(14)16-9-4-1-2-6-10(17)15-8-5-3-7-11(18)19/h15,18H,1-9,13-14H2
charge 0 multiplicity 1
43 atoms
O  3.346034 1.377499 -1.472757
O  -2.838942 -2.795375 0.159703
O  -1.109062 -3.330289 1.60953
N  3.393462 -0.383292 0.04212
N  -2.20079 0.956234 0.002083
N  -4.066034 2.027091 -1.11877
N  -3.835233 -0.303418 -1.15252
C  1.936289 1.81345 1.691547
C  0.707843 2.019831 0.776907
C  3.294639 1.911755 0.936194
C  -0.620634 2.097007 1.558711
C  1.725646 -1.618852 -1.362875
C  3.217001 -1.41593 -0.995998
C  0.883234 -2.17598 -0.194898
C  3.359871 0.96876 -0.269902
C  -1.854738 2.249444 0.644233
C  -0.627794 -2.066853 -0.475466
C  -1.469801 -2.791682 0.543031
C  -3.302777 0.914991 -0.725106
H  1.931772 2.580301 2.492776
H  1.85071 0.832617 2.204926
H  0.642947 1.201108 0.034781
H  0.844376 2.95415 0.193489
H  3.429324 2.934669 0.545386
H  4.128279 1.70176 1.635494
H  -0.578422 2.960276 2.255426
H  -0.757805 1.185676 2.173477
H  1.32371 -0.643126 -1.697553
H  1.66185 -2.30341 -2.232997
H  3.774626 -1.084975 -1.889145
H  3.664594 -2.360062 -0.632182
H  1.15977 -3.229652 0.00556
H  1.105659 -1.613229 0.73245
H  3.35993 -0.660677 1.024166
H  -2.711233 2.628834 1.249945
H  -1.621372 3.040801 -0.110618
H  -0.957927 -1.000516 -0.461525
H  -0.882151 -2.458722 -1.479896
H  -3.372842 -3.241993 0.870585
H  -3.704685 2.964304 -0.970594
H  -5.045488 1.919541 -1.370273
H  -3.448025 -1.165156 -0.754401
H  -4.315409 -0.353913 -2.048844
