program: Gaussian 09
title: 000126807
version: EM64L-G09RevD.01
frameworkgroup: C1[X(C2H4BrO5P)]
method: RPBEPBE
basis: SDD
operation: Freq
keyword: #p
keyword: freq=noraman
keyword: PBEPBE/SDD
title: #p freq=noraman PBEPBE/SDD
converged: YES YES NO NO
title: Mulliken charges:
elementType: Br P O O O O O C C H H H H
charge: 0.129602 1.298885 -0.673061 -0.656170 -0.564859 -0.371043 -0.234149 -0.849907 0.320783 0.387430 0.406980 0.407899 0.397609
chargesum: 0.00000
title: Mulliken charges with hydrogens summed into heavy atoms:
elementType: Br P O O O O O C C
charge: 0.129602 1.298885 -0.266081 -0.248272 -0.564859 0.026566 -0.234149 -0.462477 0.320783
polarizability: 8.47114707e+01 7.36142650e+00 7.85560628e+01 1.35948246e+00 -1.49777609e+00 5.91114166e+01
1716.lowfreq: -5.4256 -0.0014 0.0009 0.0018 4.0455 8.6722 28.6310 59.4487 119.7711
frequency: 28.5697 59.3462 119.7680 141.0076 150.3416 175.8708 242.7118 253.1955 293.4402 308.2096 352.3721 378.7792 426.6327 498.7648 582.3942 626.9313 676.9421 714.3791 734.0531 770.4658 894.5927 1010.0607 1040.9622 1061.4004 1085.2653 1136.2010 1201.3826 1333.1954 1630.9626 3097.2073 3515.8116 3555.9609 3612.0881
redmass: 9.6307 10.6796 10.1248 8.5853 8.7161 2.7867 5.3558 3.0302 3.2378 6.3389 5.4241 1.5195 3.6693 3.4529 3.9784 1.4876 12.9054 5.3127 8.9541 6.0499 5.5758 1.4260 1.3034 2.3814 2.4566 1.1932 1.3057 2.6334 9.5313 1.0849 1.0643 1.0654 1.0664
irintensity: 1.0451 6.1797 2.9447 1.3163 2.7157 33.5125 11.9435 41.2593 39.8848 11.4529 73.1982 71.5514 261.3994 14.8068 33.2806 140.7355 133.9420 53.2624 162.9871 20.8528 3.5348 19.9227 163.2873 42.9138 276.5789 5.0069 27.0696 84.3659 197.1349 6.3102 50.3484 83.7342 81.7304
temp: 298.150 k
press: 1.00000 atm
elementType: 35 15 8 8 8 8 8 6 6 1 1 1 1
symmnumber: 1
zpe: 189663.5 jmol-1
zpe.correction: 0.072239 hartree
zpe.thermalcorrener: 0.083343 hartree
zpe.thermalcorrenthalpy: 0.084287 hartree
zpe.thermalcorrgfe: 0.033528 hartree
zpe.sumelectzpe: -808.690291 hartree
zpe.sumelectthermal: -808.679188 hartree
zpe.sumelectthermalent: -808.678244 hartree
zpe.sumelectthermalfe: -808.729002 hartree
dipole: -0.9957 2.1990 -2.0324
dipole: 3.1556
quadrupole: -65.2073 -57.8973 -76.9710
quadrupole: -6.2603 -3.4998 2.6852
quadrupole: 1.4846 8.7946 -10.2792 -6.2603 -3.4998 2.6852
hfenergy: -808.7625305 hartree
pointgroup: C01 [X(C2H4Br1O5P1)]
dipole: -0.7931967 -0.1829121 0.9373794 debye
dipolederiv: -0.1042743 0.0722351 -0.0523186 0.0469877 -0.2530946 0.0907374 -0.0458903 0.104528 -0.0444075 1.9917354 -0.1496456 0.1616899 0.2086624 1.6310179 -0.030393 -0.0084814 0.0650097 1.4710007 -0.818465 -0.1731837 -0.2899704 -0.2754985 -0.6810144 -0.0719537 -0.3075896 -0.0834461 -0.7400332 -0.7390284 0.159758 0.0982717 0.1242363 -1.0468855 0.2488156 0.1306688 0.2409099 -0.5540612 -0.6947482 0.0417669 0.0372022 -0.0016613 -0.5622472 -0.0081332 0.0261371 -0.0315162 -0.6486926 -1.1411232 0.1611413 0.407289 0.1287329 -0.2938444 -0.0083764 0.3307281 -0.0153745 -0.5184489 -0.6684248 -0.1265084 0.1126519 0.1760757 -0.8032491 -0.2174754 0.1580936 -0.2281341 -0.3817878 -0.2185553 -0.1684893 0.096271 -0.2784314 0.0322332 -0.1685199 0.1989876 -0.307977 -0.0098288 1.4065339 0.2127507 -0.5685628 0.010518 1.0015092 0.3104322 -0.4427524 0.3856512 0.4668478 0.0472079 0.0401733 0.0220057 0.0265465 0.0449335 0.0580365 -0.0063594 0.0150912 0.0390462 0.2349533 0.0725082 0.1065026 0.0533617 0.3654308 -0.0464001 0.0657715 -0.0533941 0.3280428 0.3730436 -0.0922275 -0.1085356 -0.1234761 0.3909109 -0.0884991 -0.074009 -0.0124848 0.2188427 0.3311451 -0.0502789 -0.0224966 -0.0960539 0.1742998 -0.0682709 -0.0253046 -0.0788633 0.3734797 unknown
polarizability: 75.1432876|-5.5795981|85.2901903|-1.1905842|-8.2018755|61.9454722 unknown
InChI: InChI=1S/C2H4BrO5P/c3-1(2(4)5)9(6,7)8/h1,4,6-7H
charge 0 multiplicity 1
13 atoms
Br -0.737075 2.205716 -0.761051
P  1.410721 -0.094197 -0.129232
O  2.334549 0.916001 0.90867
O  1.499069 -1.578971 0.761271
O  1.821928 -0.157589 -1.659127
O  -2.552868 -0.040003 0.806037
O  -1.209528 -1.581785 -0.297055
C  -0.284515 0.605071 0.358308
C  -1.365599 -0.457441 0.233013
H  -0.205829 0.971002 1.393971
H  3.31174 0.9062 0.750983
H  1.035755 -2.327095 0.298356
H  -3.252548 -0.740407 0.695857
