program: Gaussian 09
title: 000134172
version: EM64L-G09RevD.01
frameworkgroup: C1[X(C3H6N4O)]
method: RPBEPBE
basis: SDD
operation: Freq
keyword: #pfreq=noraman
keyword: PBEPBE/SDD
title: #p freq=noraman PBEPBE/SDD
converged: NO NO NO NO
title: Mulliken charges:
elementType: O N N N N C C C H H H H H H
charge: -0.226122 -0.300877 -0.342847 -0.129862 -0.620834 0.272787 -0.474379 0.054378 0.252343 0.250891 0.343602 0.329905 0.291739 0.299275
chargesum: 0.00000
title: Mulliken charges with hydrogens summed into heavy atoms:
elementType: O N N N N C C C
charge: -0.226122 0.042725 -0.012942 -0.129862 -0.029819 0.272787 0.028855 0.054378
polarizability: 8.75356338e+01 -3.74179157e+00 6.05858560e+01 2.54395990e+00 -6.70449733e-01 3.62304401e+01
1716.lowfreq: -19.0176 -10.8558 -4.8155 -0.0008 -0.0008 -0.0007 60.7527 166.7059 204.2939
frequency: 60.5278 166.7047 204.2886 243.2885 285.3781 386.4766 416.3839 522.7577 583.9937 601.8736 646.4878 713.3301 725.8774 753.9700 882.0035 911.3345 974.3356 1023.9421 1073.4275 1105.4570 1148.7359 1231.4427 1286.4439 1313.8527 1347.4766 1438.7034 1466.0371 1525.4045 1650.4729 1685.3251 2992.3828 3052.0278 3484.8491 3508.1082 3576.1289 3609.7346
redmass: 2.6021 4.3091 3.2885 1.2803 6.5227 3.6504 1.4036 5.3480 1.9436 1.7476 2.1269 4.0157 3.6505 4.3238 3.9525 1.6581 5.2942 3.6173 3.3222 2.0492 1.2865 2.2850 1.3320 1.5491 1.4198 2.3344 1.2581 6.9778 1.0973 9.9267 1.0612 1.1015 1.0466 1.0802 1.0816 1.0979
irintensity: 5.7912 11.8356 1.9674 18.3312 27.2075 23.1077 146.9784 6.9895 162.4976 90.1272 66.2300 103.2576 47.3977 18.9428 21.5839 2.2437 22.4895 65.2426 40.6358 13.4306 1.0022 23.3599 20.2389 10.6743 28.1189 57.2975 14.1441 144.3683 71.3803 447.9942 25.6916 11.6176 4.7686 91.1290 45.9225 7.8690
temp: 298.150 k
press: 1.00000 atm
elementType: 8 7 7 7 7 6 6 6 1 1 1 1 1 1
symmnumber: 1
zpe: 278723.7 jmol-1
zpe.correction: 0.106160 hartree
zpe.thermalcorrener: 0.113825 hartree
zpe.thermalcorrenthalpy: 0.114769 hartree
zpe.thermalcorrgfe: 0.073971 hartree
zpe.sumelectzpe: -411.505386 hartree
zpe.sumelectthermal: -411.497721 hartree
zpe.sumelectthermalent: -411.496777 hartree
zpe.sumelectthermalfe: -411.537575 hartree
dipole: -7.5300 4.1068 -0.3682
dipole: 8.5850
quadrupole: -48.5460 -44.9601 -45.3146
quadrupole: 8.1787 -2.7459 -0.1404
quadrupole: -2.2724 1.3135 0.9590 8.1787 -2.7459 -0.1404
hfenergy: -411.6115462 hartree
pointgroup: C01 [X(C3H6N4O1)]
dipole: -2.8842478 1.3149457 1.1662747 debye
dipolederiv: -1.3937221 0.2306713 0.2302039 0.0838547 -0.4314581 -0.0505454 0.1227804 -0.0424332 -0.4206444 -0.3137806 0.2071011 0.1608848 0.4193315 -0.867671 -0.307865 0.0806216 -0.0794386 -0.1115429 -0.2696823 -0.1640338 -0.1057551 0.1086217 -0.2568247 -0.1617869 0.1223202 -0.3240554 -0.7043354 -1.2741342 0.169018 0.13486 -0.131594 -0.3622491 -0.0446531 -0.0521788 -0.0746245 -0.311256 -0.6110525 -0.1255028 0.0478406 -0.1130594 -0.5277127 -0.1862343 0.1286294 -0.2143593 -0.4351855 0.6832668 -0.1050939 -0.058526 -0.3897116 0.5993987 0.2902022 -0.1333721 0.3617593 0.2251043 0.3533986 -0.0712068 -0.1852244 0.0273343 0.2764606 0.0358984 -0.2532545 0.0726386 0.2866121 2.0095385 -0.3431137 -0.3230407 -0.0662016 0.5791273 0.3438263 -0.1232562 0.2813488 0.5135898 0.0353894 0.0219466 0.0520354 -0.0122258 -0.1303256 -0.0701607 0.0524675 -0.0335983 0.0651755 -0.0194631 0.0181805 -0.0521032 0.0630331 0.0783026 0.0723495 -0.0134383 0.0378774 -0.0505728 0.346159 -0.0069452 -0.0148475 -0.0461206 0.3952153 0.0054377 0.0186577 -0.1221124 0.2207869 0.1807997 0.0366846 0.0386871 0.0028198 0.1688835 -0.0807843 0.0153297 0.0121079 0.4113126 0.2155767 0.0498615 0.0803546 0.0443737 0.1679213 0.1261045 0.0679038 0.0832578 0.1508953 0.057706 0.0824325 -0.0053693 0.0095441 0.3109319 0.0282111 -0.0332105 0.0416318 0.1600607 unknown
polarizability: 87.1778092|-2.8379858|51.8090386|-4.5602747|11.9955053|45.3650821 unknown
InChI: InChI=1S/C3H6N4O/c4-1-2-5-3(8)7-6-2/h6-7H,1,4H2
charge 0 multiplicity 1
14 atoms
O  2.896629 -0.300366 -0.573783
N  -0.21891 1.00648 0.361567
N  1.184052 0.972414 0.49909
N  0.521264 -0.785276 -0.836729
N  -2.805938 0.116714 0.540885
C  -0.542621 -0.121099 -0.372507
C  -1.999634 -0.472655 -0.556283
C  1.68308 -0.085667 -0.350583
H  -2.077968 -1.57363 -0.641482
H  -2.343737 -0.054527 -1.52021
H  -0.852324 1.384689 1.073675
H  1.698011 1.833894 0.68884
H  -2.916564 -0.497766 1.352542
H  -3.697839 0.515594 0.241278
