program: Gaussian 09
title: 000134173
version: EM64L-G09RevD.01
frameworkgroup: C1[X(C7H4N4O4)]
method: RPBEPBE
basis: SDD
operation: Freq
keyword: #pfreq=noraman
keyword: PBEPBE/SDD
title: #p freq=noraman PBEPBE/SDD
converged: NO YES YES YES
title: Mulliken charges:
elementType: O O O O N N N N C C C C C C C H H H H
charge: -0.143719 -0.220541 -0.193384 -0.199934 -0.436214 0.034181 0.021519 0.089597 0.388639 -0.001617 -0.485517 0.435490 -0.262189 0.097552 -0.364489 0.366520 0.304603 0.273886 0.295616
chargesum: 0.00000
title: Mulliken charges with hydrogens summed into heavy atoms:
elementType: O O O O N N N N C C C C C C C
charge: -0.143719 -0.220541 -0.193384 -0.199934 -0.069694 0.034181 0.021519 0.089597 0.388639 -0.001617 -0.180914 0.435490 0.011697 0.097552 -0.068873
polarizability: 2.36905304e+02 5.34369144e+00 1.29469227e+02 6.95474088e-03 3.87231752e-03 4.41014962e+01
1716.lowfreq: -6.8835 -6.4809 -0.0010 -0.0008 -0.0008 5.6489 55.7043 61.0130 85.4231
frequency: 55.6965 61.0127 85.4182 127.0459 155.3699 222.8764 272.9625 285.3668 329.2756 380.8214 421.3448 431.7115 504.7310 560.6054 571.2016 601.0009 606.3392 667.4733 698.7116 708.3092 715.8397 735.5622 768.1117 781.4101 822.3459 854.0482 916.5584 927.3958 952.5003 994.3855 1054.6906 1115.8241 1140.6289 1190.3138 1213.7856 1219.2903 1257.3519 1277.1058 1357.9558 1370.4536 1390.8318 1403.2535 1426.9896 1481.6090 1485.9264 1584.8113 1635.1982 3178.8695 3186.5250 3196.4488 3573.3425
redmass: 14.6112 13.6582 7.7910 12.9056 9.4519 9.4770 4.9651 14.0033 8.5381 9.0616 9.5082 3.0540 8.5855 6.1856 5.2220 8.7837 7.8804 8.0044 2.4149 3.7555 2.1730 11.3223 10.1136 3.5697 5.3941 1.5916 1.5426 4.3671 10.4821 1.3383 2.0940 1.6685 1.9144 4.8633 4.9178 3.7436 1.7458 6.8448 3.4150 7.7004 7.2499 4.2002 7.0539 5.3019 5.5182 8.4439 8.1466 1.0895 1.0939 1.0975 1.0820
irintensity: 0.5761 2.2885 4.2340 4.6137 2.7570 1.7469 7.5024 0.1550 1.1906 3.1933 3.5522 11.9562 1.6242 5.7174 0.8327 0.2859 1.4118 6.6246 4.4976 28.1852 107.3137 12.7611 48.4138 0.0595 8.3426 35.9252 44.5803 6.5088 0.6581 0.7070 43.7850 17.2679 3.3611 584.3154 67.0331 18.6748 9.3588 124.6847 31.7977 147.3850 134.0135 24.3298 16.3897 13.7908 1.0113 14.3391 5.3797 2.4502 5.6064 1.9422 128.4066
temp: 298.150 k
press: 1.00000 atm
elementType: 8 8 8 8 7 7 7 7 6 6 6 6 6 6 6 1 1 1 1
symmnumber: 1
zpe: 310769.7 jmol-1
zpe.correction: 0.118366 hartree
zpe.thermalcorrener: 0.129761 hartree
zpe.thermalcorrenthalpy: 0.130705 hartree
zpe.thermalcorrgfe: 0.079709 hartree
zpe.sumelectzpe: -787.823204 hartree
zpe.sumelectthermal: -787.811808 hartree
zpe.sumelectthermalent: -787.810864 hartree
zpe.sumelectthermalfe: -787.861860 hartree
dipole: 0.3468 -0.6223 0.0022
dipole: 0.7124
quadrupole: -127.3308 -81.3617 -83.1926
quadrupole: 9.5838 -0.0098 -0.0027
quadrupole: -30.0357 15.9333 14.1025 9.5838 -0.0098 -0.0027
hfenergy: -787.9415695 hartree
pointgroup: C01 [X(C7H4N4O4)]
dipole: -0.1379193 0.2439984 0.0008481 debye
dipolederiv: -0.8790724 0.1694821 -0.0001629 0.2344357 -0.4992365 0.0003625 0.000646 -0.0003188 -0.1690658 -0.6709385 -0.0895458 0.0000188 -0.309146 -0.7650847 -0.0002414 0.0003831 0.0005743 -0.2360859 -0.9001747 -0.1732154 -0.0000733 -0.1101739 -0.545418 -0.0000731 0.0000113 0.0000141 -0.2166231 -0.6610443 0.1413272 -0.0000092 0.2732012 -0.7502593 0.000017 0.0000045 -0.0000906 -0.2235391 -0.1779979 0.0534767 -0.0000283 -0.252495 -0.5652177 0.0000263 -0.000283 -0.0000376 -0.2217892 -0.0634507 -0.126767 -0.0000416 0.1448333 -0.3109938 -0.0001103 -0.0004533 -0.0000897 -0.1899769 1.9648444 -0.099347 0.0000857 -0.3722568 1.1144136 0.000068 0.0001168 0.000052 0.1870243 2.1940287 0.0954038 -0.0001214 0.2345239 1.1437142 -0.00023 -0.0005514 -0.0002034 0.1792345 -0.0000572 0.2602981 0.0000804 0.2210528 -0.0566495 0.0000507 -0.0000626 0.0000007 0.1000362 0.0870512 0.0763342 0.0000817 0.0377825 0.0502883 0.0000133 0.0000199 0.0000665 0.0099683 0.3271716 -0.2079174 0.0000076 0.094784 -0.0930827 0.000019 0.0000755 -0.0000091 -0.128802 -0.8223686 0.1447781 -0.0000087 -0.0255855 0.1331421 0.0000026 -0.0000754 0.000017 0.0692713 0.0406665 -0.0851036 -0.000007 0.0717675 0.1852576 -0.0000393 0.0001046 -0.0000154 -0.1007936 -0.8665824 -0.2491096 0.0001859 -0.3473223 0.5369249 0.0001222 0.0001356 -0.0000155 0.16692 -0.1021347 0.1130167 0.0000322 0.0321581 -0.0718668 -0.0000274 -0.0000497 0.0000035 -0.1325372 0.2348568 -0.0026584 -0.0000169 0.0858731 0.3089763 0.000029 0.0000151 0.000046 0.3657576 0.1254172 0.0091886 -0.0000064 -0.0091845 0.0732405 0.0000023 -0.0000198 -0.0000033 0.1959038 0.0873854 0.033146 -0.0000074 0.0082288 0.0044878 0.0000073 0.0000081 0.0000066 0.1652985 0.0823995 -0.0627872 -0.0000094 -0.0124771 0.1073636 0.0000012 -0.0000254 0.0000028 0.1797984 unknown
polarizability: 236.8367691|5.9927882|129.5377619|-0.0069312|-0.0039143|44.1014962 unknown
InChI: InChI=1S/C7H4N4O4/c12-10(13)4-1-2-5-6(3-4)9-7(8-5)11(14)15/h1-3,9H
charge 0 multiplicity 1
19 atoms
O  4.575276 -0.61445 -0.000691
O  3.982232 1.606053 -0.000942
O  -4.574911 -0.397422 -0.000243
O  -3.824493 1.756846 -0.000059
N  1.365882 1.036079 0.000184
N  1.762713 -1.227427 0.00024
N  -3.629795 0.480052 -0.000284
N  3.714638 0.33089 0.00043
C  0.106281 0.432986 0.000063
C  0.37788 -0.989884 0.000126
C  -1.198606 0.954232 -0.000067
C  -2.224865 -0.009321 -0.000151
C  -0.691301 -1.919671 0.000051
C  2.292102 -0.000017 0.000292
C  -2.000135 -1.418674 -0.000094
H  1.618689 2.025624 0.000214
H  -1.442944 2.01891 -0.0001
H  -0.486224 -2.992997 0.000096
H  -2.867922 -2.082311 -0.000168
