program: Gaussian 09
title: 000134179
version: EM64L-G09RevD.01
frameworkgroup: C1[X(C14H18N4)]
method: RPBEPBE
basis: SDD
operation: Freq
keyword: #pfreq=noraman
keyword: PBEPBE/SDD
title: #p freq=noraman PBEPBE/SDD
converged: YES YES NO NO
title: Mulliken charges:
elementType: N N N N C C C C C C C C C C C C C C H H H H H H H H H H H H H H H H H H
charge: -0.100030 -0.413855 -0.423693 -0.073938 0.235524 -0.697824 -0.704433 -0.698145 0.418217 0.424827 -0.187818 0.268176 -0.339971 -0.467581 -0.411401 -0.383727 -0.421129 -0.248638 0.230626 0.212907 0.202393 0.221791 0.221963 0.191603 0.202480 0.212957 0.230399 0.189266 0.300183 0.235422 0.208818 0.322864 0.216207 0.311241 0.256036 0.258285
chargesum: 0.00000
title: Mulliken charges with hydrogens summed into heavy atoms:
elementType: N N N N C C C C C C C C C C C C C C
charge: -0.100030 -0.113672 -0.112452 -0.073938 0.235524 -0.051898 -0.069076 -0.052309 0.418217 0.424827 0.001448 0.268176 -0.017107 -0.251375 -0.175979 -0.174908 -0.165093 0.009647
polarizability: 3.39140836e+02 -1.12999479e+01 1.80702035e+02 2.78439907e+00 3.16239527e+00 9.88281013e+01
1716.lowfreq: -7.0809 -0.4290 -0.0003 0.0002 0.0004 4.5365 12.6600 30.8271 55.4627
frequency: 7.0723 30.8098 55.4606 58.8562 72.7258 120.5412 134.7867 177.6683 179.3971 189.3099 247.2622 257.6981 263.6686 286.1108 308.9950 338.9398 341.5909 395.8345 411.0460 414.8575 440.5909 467.4866 474.8222 532.0122 575.5325 590.5819 628.6575 636.7721 649.6174 663.8279 672.3576 734.7025 765.3469 780.2958 805.0621 810.0692 821.2091 869.0135 887.7355 904.4491 915.6153 933.1656 935.5994 939.3678 946.4493 951.9594 1003.3328 1005.1539 1019.6189 1027.9338 1052.9932 1099.4663 1114.6858 1117.9801 1138.0757 1195.8600 1202.5228 1225.9069 1227.3066 1242.9890 1278.8411 1289.2704 1306.7085 1321.7389 1358.0701 1365.3816 1366.8098 1374.1519 1392.1833 1400.9448 1416.4948 1430.7956 1451.7875 1460.3535 1463.2546 1476.1890 1478.7559 1484.6399 1489.7167 1515.7556 1569.5441 1587.9293 1628.4075 1644.3027 2954.7429 2973.6359 2976.9177 2984.0160 3066.9152 3073.0180 3080.5032 3081.3535 3088.6414 3090.1860 3103.2924 3129.3837 3142.3140 3177.4877 3227.4627 3239.6212 3546.3394 3590.2462
redmass: 2.9686 3.8098 4.1149 4.5135 4.6864 4.8124 3.0026 3.7451 4.4632 1.0442 2.5123 1.2531 1.0918 3.4750 4.0054 2.9732 2.6372 4.0282 2.9976 3.1418 3.6562 3.5267 3.1017 2.3878 1.1985 5.2906 5.6399 2.2718 1.4471 3.3636 4.4165 3.4355 1.4224 5.1249 3.2071 1.4648 1.5979 1.4571 5.9941 1.6568 1.7100 1.4046 3.9732 1.2536 6.6139 1.4327 2.8993 1.3491 1.4161 1.3863 2.1443 1.9069 2.7520 1.6533 2.3381 1.2014 2.1808 3.0367 1.4841 3.0028 2.4253 1.8643 1.9398 2.2366 2.3344 1.9136 1.2765 1.7059 1.5205 1.2763 3.7379 3.4121 1.0502 1.0494 1.0485 1.0568 1.0612 2.1400 1.0563 2.7238 4.4503 4.3568 5.9216 4.8366 1.0842 1.0347 1.0359 1.0357 1.0998 1.0989 1.1005 1.0999 1.0992 1.0997 1.0865 1.0961 1.0905 1.0957 1.0969 1.0999 1.0764 1.0815
irintensity: 0.4457 4.8237 0.1229 0.0459 0.5569 2.6284 10.8745 1.0994 5.9297 0.3703 4.5873 1.2260 0.5548 11.0462 0.2504 1.2889 0.1452 1.7036 0.1021 0.7156 1.6144 0.3843 5.8263 28.8611 64.7583 5.6218 8.9467 86.5181 19.8144 0.2989 0.8579 0.2777 29.6134 0.8505 3.0314 82.7507 2.4847 45.2624 10.4519 0.4531 1.4696 0.1652 3.3391 0.4051 7.2640 8.1823 1.2653 2.7007 0.2915 6.7814 24.0720 60.5559 11.4624 11.6335 30.2719 38.5754 111.1792 21.2709 0.2151 43.8386 12.8912 7.6196 1.6531 25.7058 2.1349 5.0768 20.4881 35.5375 120.4720 1.5402 14.4048 54.4028 0.1950 0.2168 1.2914 9.4589 17.7647 37.4258 6.7333 502.0501 19.1392 91.0395 186.3942 307.7680 76.0165 27.4187 57.8544 29.0473 1.3993 63.7547 6.5969 11.0460 120.0228 45.6246 26.2909 29.2386 4.6881 14.8308 6.4447 1.3916 20.2802 26.5313
temp: 298.150 k
press: 1.00000 atm
elementType: 7 7 7 7 6 6 6 6 6 6 6 6 6 6 6 6 6 6 1 1 1 1 1 1 1 1 1 1 1 1 1 1 1 1 1 1
symmnumber: 1
zpe: 779826.8 jmol-1
zpe.correction: 0.297020 hartree
zpe.thermalcorrener: 0.314584 hartree
zpe.thermalcorrenthalpy: 0.315528 hartree
zpe.thermalcorrgfe: 0.249273 hartree
zpe.sumelectzpe: -761.970477 hartree
zpe.sumelectthermal: -761.952913 hartree
zpe.sumelectthermalent: -761.951969 hartree
zpe.sumelectthermalfe: -762.018224 hartree
dipole: -3.5144 5.7971 0.7566
dipole: 6.8213
quadrupole: -107.6721 -97.3949 -113.2196
quadrupole: 17.4577 6.1112 0.6121
quadrupole: -1.5765 8.7006 -7.1241 17.4577 6.1112 0.6121
hfenergy: -762.267497 hartree
pointgroup: C01 [X(C14H18N4)]
dipole: -1.3878783 2.2647358 0.3834598 debye
polarizability: 339.2103192|-10.9532101|180.3043856|1.8118477|6.1571905|99.1562679 unknown
InChI: InChI=1S/C14H18N4/c1-14(2,3)18-10-16-12-6-4-11(5-7-12)13-8-15-9-17-13/h4-10,16-17H,1-3H3
charge 0 multiplicity 1
36 atoms
N  -3.258329 -0.144686 -0.010168
N  -1.838229 1.779466 -0.045369
N  4.65304 0.443546 0.309896
N  5.432331 -1.601789 -0.251474
C  -4.659322 -0.697626 0.00721
C  -5.435115 -0.265387 -1.268424
C  -4.504401 -2.236127 0.024386
C  -5.415222 -0.234834 1.284069
C  -0.536981 1.221407 -0.050751
C  2.15338 0.227814 -0.058164
C  -3.085654 1.146516 -0.028035
C  3.519275 -0.30514 -0.062284
C  -0.288188 -0.180024 -0.037807
C  0.56987 2.116044 -0.071032
C  1.035916 -0.652596 -0.036811
C  1.886891 1.626757 -0.078888
C  4.039513 -1.566484 -0.404682
C  5.772997 -0.372938 0.185503
H  -4.875038 -0.558888 -2.174467
H  -6.426689 -0.752959 -1.299095
H  -5.594227 0.828793 -1.299371
H  -3.934841 -2.551445 0.916439
H  -3.948758 -2.572655 -0.868669
H  -5.491105 -2.734908 0.038006
H  -5.573188 0.859943 1.29162
H  -6.406534 -0.720562 1.341769
H  -4.841376 -0.507315 2.188086
H  -3.906093 1.894041 -0.031822
H  -1.874123 2.800123 -0.057875
H  1.209332 -1.733818 -0.001339
H  2.711383 2.34849 -0.135703
H  -1.14338 -0.858429 -0.018844
H  0.396382 3.200158 -0.092956
H  4.640022 1.399989 0.660627
H  3.499532 -2.434382 -0.776129
H  6.782128 -0.041894 0.418452
