program: Gaussian 09
title: 000134157
version: EM64L-G09RevD.01
frameworkgroup: C1[X(C6H9NO3)]
method: RPBEPBE
basis: SDD
operation: Freq
keyword: #pfreq=noraman
keyword: PBEPBE/SDD
title: #p freq=noraman PBEPBE/SDD
converged: YES YES NO NO
title: Mulliken charges:
elementType: O O O N C C C C C C H H H H H H H H H
charge: -0.229400 -0.159225 -0.262166 -0.386759 -0.229591 -0.008809 0.146582 -0.674446 0.270338 -0.776749 0.308531 0.256280 0.248559 0.234234 0.213739 0.312899 0.258854 0.262624 0.214503
chargesum: 0.00000
title: Mulliken charges with hydrogens summed into heavy atoms:
elementType: O O O N C C C C C C
charge: -0.229400 -0.159225 -0.262166 -0.073860 0.078940 0.247471 0.146582 0.022086 0.270338 -0.040768
polarizability: 9.42006208e+01 -6.13316822e-02 7.77938967e+01 1.59941074e+00 3.82277450e+00 6.72477235e+01
1716.lowfreq: -11.4803 -2.3700 -0.0003 0.0007 0.0007 6.8748 33.8163 66.5344 87.2627
frequency: 33.7311 66.5273 87.2576 92.3111 147.3322 191.1407 225.4530 258.3066 362.0977 374.8585 457.4558 516.3485 559.8292 595.7906 611.2918 632.9826 719.1404 759.4490 840.2155 877.7162 939.9795 981.0534 999.7750 1033.8125 1042.7964 1049.5584 1140.8902 1182.7707 1197.6919 1250.6766 1253.4525 1322.6641 1343.7385 1390.1251 1393.3033 1449.5582 1457.4170 1465.1465 1472.9100 1479.7155 1627.0223 1770.5235 2992.4249 2998.8515 3030.7996 3073.1879 3092.8175 3097.4369 3102.1039 3106.3805 3560.7713
redmass: 4.7518 1.4055 2.5450 3.3360 4.2596 1.1741 4.3431 3.3957 3.3205 3.5538 4.9366 2.3195 1.9377 2.2947 4.6200 5.4136 4.0687 4.9516 3.5087 6.0320 3.1067 2.8874 1.8374 1.3996 1.6564 2.0276 2.7029 1.4368 2.7455 2.1209 1.6212 1.4611 1.4296 1.2182 1.2550 1.0533 1.0511 1.2408 1.1854 1.3167 6.2702 12.8338 1.0363 1.0363 1.0830 1.0913 1.0978 1.0990 1.0990 1.0997 1.0782
irintensity: 10.9441 4.5129 1.0313 3.8768 10.3127 0.7521 1.6909 0.8861 0.8654 8.1064 5.5318 32.9337 48.9334 14.3263 14.2226 6.8469 4.1472 58.5480 13.9291 10.3648 0.1925 100.3840 38.7495 26.4014 14.1672 44.8933 6.5655 14.5750 7.2537 64.0146 59.5842 89.3129 6.7062 60.7213 27.1083 21.7585 6.2269 134.3813 50.2901 58.1259 175.3313 366.1427 9.2794 8.1517 29.4973 3.6488 21.5307 11.5272 33.6910 12.3256 18.4784
temp: 298.150 k
press: 1.00000 atm
elementType: 8 8 8 7 6 6 6 6 6 6 1 1 1 1 1 1 1 1 1
symmnumber: 1
zpe: 387043.3 jmol-1
zpe.correction: 0.147417 hartree
zpe.thermalcorrener: 0.158133 hartree
zpe.thermalcorrenthalpy: 0.159077 hartree
zpe.thermalcorrgfe: 0.109851 hartree
zpe.sumelectzpe: -513.686405 hartree
zpe.sumelectthermal: -513.675689 hartree
zpe.sumelectthermalent: -513.674745 hartree
zpe.sumelectthermalfe: -513.723971 hartree
dipole: 2.0083 3.5895 -2.5372
dipole: 4.8328
quadrupole: -66.8346 -62.3612 -58.4092
quadrupole: -7.3700 -10.4389 -1.4404
quadrupole: -4.2996 0.1739 4.1258 -7.3700 -10.4389 -1.4404
hfenergy: -513.8338222 hartree
pointgroup: C01 [X(C6H9N1O3)]
dipole: -0.8855043 -1.1965555 -1.1829085 debye
dipolederiv: -0.6792787 0.2339339 -0.0688979 0.1465834 -1.1819014 0.0135187 0.0238893 0.0457162 -0.2880756 -0.5334025 -0.2293461 0.0393825 -0.2278927 -1.2039176 0.0837523 0.0900551 0.2031762 -0.3036984 -0.7644948 0.0434978 0.0408878 -0.0218856 -0.3612013 0.0797684 0.3573462 0.0185358 -0.9302532 -1.2900771 0.1438956 0.1985309 0.0937928 -0.4746557 -0.0216343 0.0460057 -0.0156555 -0.3555235 0.1834583 -0.1884823 0.1288296 -0.2126922 0.1052289 0.0034127 0.5607453 0.0163087 0.1837832 0.1783517 0.33408 0.0139443 0.0905173 0.5252873 0.0358255 -0.0337036 0.0053862 0.3587268 0.9734015 -0.1664196 -0.0955764 0.1713663 1.9074069 -0.168039 -0.2228661 -0.2518548 0.2045364 -0.0093068 -0.0390809 -0.0052923 -0.0274936 -0.114824 -0.1029001 -0.0345002 -0.1136652 -0.068189 1.6831509 -0.1855551 -0.2145322 -0.1141649 0.2198428 -0.1141799 -0.4812775 -0.053892 1.1019215 -0.2995882 0.0691559 -0.2117149 0.092124 -0.0101371 0.0576117 -0.1858324 0.0460892 -0.1026209 0.1908426 0.0214276 0.0520398 0.0152309 0.0894448 -0.0181147 -0.0966364 -0.0253277 0.0385089 0.0201506 -0.0324221 -0.012518 0.0206733 -0.014318 0.0456077 -0.0169103 0.0772109 -0.0943302 -0.0198863 0.1325057 0.0120985 0.1095856 0.0113772 -0.0201656 -0.0102276 -0.0264371 0.0955101 -0.0361916 -0.1226527 0.0200635 -0.0971268 0.0403248 0.0033803 0.0343177 -0.014317 0.0791366 0.1171258 0.0076172 -0.0262971 -0.0059977 0.0130472 0.1271126 -0.0325536 0.0641901 -0.075685 0.1337521 -0.0018684 0.0181539 -0.0060211 0.3287208 0.0146235 -0.0180944 0.022941 0.1097107 0.0341268 -0.082186 -0.0032104 -0.1223787 0.0253799 0.0018139 -0.002047 0.0417452 0.0871493 0.0863755 0.0581325 0.0051456 0.0910028 -0.0203936 -0.0216931 -0.0035492 -0.0522045 0.0806807 0.0314901 0.003767 0.1089628 0.0047769 0.1152881 0.0002995 0.0258391 0.0120543 -0.1212882 unknown
polarizability: 94.1288458|-1.5738798|78.6749953|-0.7581232|-2.4592096|66.4383999 unknown
InChI: InChI=1S/C6H9NO3/c1-3-5(6(9)10-3)7-4(2)8/h3,5,7H,1-2H3
charge 0 multiplicity 1
19 atoms
O  2.423052 -0.311303 0.235579
O  1.893307 2.000987 -0.101916
O  -2.399568 0.09673 1.290958
N  -0.838908 0.203849 -0.427364
C  0.283039 0.042574 0.468905
C  1.196659 -1.234665 0.413903
C  1.575665 0.840794 0.154515
C  1.044469 -2.192011 -0.754104
C  -2.148809 0.25116 0.060367
C  -3.22882 0.50667 -0.980943
H  -0.09399 0.235299 1.490192
H  1.298787 -1.752487 1.38055
H  1.897387 -2.890988 -0.789086
H  0.117341 -2.782325 -0.637732
H  1.000819 -1.657355 -1.719452
H  -0.669485 0.352872 -1.422853
H  -4.002735 -0.274736 -0.898839
H  -3.716444 1.472605 -0.76167
H  -2.847866 0.529532 -2.01631
