program: Gaussian 09
title: 000134152
version: EM64L-G09RevD.01
frameworkgroup: C1[X(C26H22O7S)]
method: RPBEPBE
basis: SDD
operation: Freq
keyword: #p
keyword: freq=noraman
keyword: PBEPBE/SDD
title: #p freq=noraman PBEPBE/SDD
converged: YES YES NO NO
title: Mulliken charges:
elementType: S O O O O O O O C C C C C C C C C C C C C C C C C C C C C C C C C C H H H H H H H H H H H H H H H H H H H H H H
charge: 0.168473 -0.282735 -0.264378 -0.436092 -0.190574 -0.144863 -0.373637 -0.197218 0.300922 -0.423374 -0.371446 -0.761842 0.243429 0.230205 -0.188921 -0.361565 -0.360112 0.358390 -0.273495 -0.172844 -0.224788 -0.224496 -0.378210 -0.397102 0.361813 -0.395402 -0.418202 0.309039 -0.370258 -0.342207 0.117412 -0.647131 0.151120 0.123597 0.272440 0.235853 0.249836 0.225472 0.291033 0.286039 0.339624 0.250650 0.253713 0.250252 0.247086 0.230387 0.230743 0.244645 0.242832 0.242386 0.242939 0.276104 0.270754 0.296680 0.265308 0.391716
chargesum: 0.00000
title: Mulliken charges with hydrogens summed into heavy atoms:
elementType: S O O O O O O O C C C C C C C C C C C C C C C C C C C C C C C C C C
charge: 0.168473 -0.282735 -0.264378 -0.096468 -0.190574 -0.144863 0.018079 -0.197218 0.300922 0.084919 0.103862 -0.184770 0.243429 0.230205 -0.188921 -0.110915 -0.106399 0.358390 -0.023243 0.074241 0.005599 0.006247 -0.133565 -0.154270 0.361813 -0.153016 -0.175263 0.309039 -0.094155 -0.071453 0.117412 -0.085143 0.151120 0.123597
polarizability: 6.51187787e+02 1.28089466e+01 2.79592113e+02 4.41697444e+01 -3.15922434e+00 1.99957765e+02
1716.lowfreq: -4.7474 -0.0021 0.0006 0.0014 1.2257 3.1532 6.4194 12.1044 14.5137
frequency: 6.0193 11.8927 14.3360 21.5724 29.5328 34.5713 38.9201 44.5857 51.9590 65.6701 79.9790 83.8708 102.8584 116.7058 121.3857 136.6914 160.0789 166.1499 206.3661 223.1017 232.2304 252.0226 260.5068 264.6578 287.7996 322.7369 331.2567 339.0678 341.0554 356.6749 375.1565 401.0039 405.2879 407.5591 411.7490 423.1423 424.6702 435.4448 460.6453 468.8904 485.7927 489.6213 501.6852 525.4465 532.2995 540.3112 549.7495 567.0818 595.1023 600.0098 616.6471 623.4189 629.8812 637.2907 661.2430 687.5256 696.2446 706.8060 711.9824 720.1379 723.0066 749.9108 760.7197 763.2536 767.9059 797.3821 818.1623 833.4891 841.7038 849.4479 856.0124 861.0291 872.6234 892.8911 935.0298 939.3988 953.4580 956.9723 967.3570 970.8428 972.4401 976.7898 979.9894 985.2661 991.5995 995.5789 1006.5968 1016.8921 1030.4390 1034.1526 1050.5667 1077.0941 1080.1344 1088.3355 1097.5590 1123.6706 1131.9061 1142.7831 1161.2746 1162.2265 1185.2216 1198.8381 1206.3843 1210.4816 1224.3749 1233.5805 1243.4738 1255.1758 1260.9134 1276.4548 1283.9206 1294.4839 1303.2186 1311.3605 1322.5875 1333.9736 1338.5419 1352.7088 1371.6215 1376.5765 1383.9451 1408.2314 1422.2686 1432.7829 1435.5235 1445.0534 1447.8356 1462.3229 1472.2693 1475.4124 1513.1661 1544.7532 1566.1386 1583.2728 1584.4126 1602.9569 1607.9813 1613.7269 1627.4082 1629.1422 2991.8169 3028.8616 3033.0162 3043.9252 3083.2576 3107.5918 3117.6455 3123.4799 3134.0965 3135.7942 3137.5812 3140.0296 3141.9031 3151.3821 3155.0497 3159.8313 3161.1373 3164.1200 3165.3970 3175.7304 3473.9660 3507.5628
redmass: 7.1502 7.5691 6.2570 8.2511 6.6723 8.5101 9.5256 5.8165 6.4773 6.5583 4.0923 6.1053 5.5851 8.4430 6.1701 4.4689 7.7547 5.4890 7.3695 6.5326 7.7354 6.7132 5.3595 4.2779 6.1157 3.7685 3.7187 6.1497 3.7656 3.9816 4.6082 4.1458 3.4047 3.0177 3.3726 1.5673 2.6161 2.5853 3.9462 3.1968 5.1068 5.0479 4.1102 4.5128 4.3908 4.8051 2.8873 3.9388 2.8556 4.9372 5.3147 6.7413 1.9904 6.6775 3.4963 5.5419 5.6769 5.0008 4.1493 4.0596 4.0186 3.8417 1.2529 4.2206 5.8411 4.9481 1.9518 1.4596 2.0184 1.3263 1.4185 1.9096 1.9392 2.4950 2.7214 1.3710 1.3766 2.2869 1.4478 1.8473 1.3023 5.6214 2.3129 4.2617 5.0350 1.4513 3.2549 3.3658 1.9484 2.6009 1.8246 2.5656 2.6011 1.9257 1.9029 1.4295 1.4143 1.9099 1.2668 1.7195 1.5833 1.1298 1.5382 1.2022 1.7307 1.6558 1.6462 1.3286 1.4467 1.4192 1.8904 2.9524 1.2866 1.4939 2.6810 1.5164 2.3738 1.2571 7.8355 9.4443 1.4482 3.4983 3.9199 1.1903 1.6544 1.2444 1.1069 1.2065 2.2436 2.1444 2.7552 6.4904 7.7670 7.3097 8.2026 6.1291 6.8887 6.9746 8.6235 10.4843 1.0621 1.0584 1.0561 1.0571 1.1028 1.1084 1.1087 1.1054 1.0876 1.0878 1.0853 1.0876 1.0881 1.0900 1.0959 1.0971 1.0954 1.0947 1.0971 1.1007 1.0651 1.0644
irintensity: 0.0674 0.0162 0.1358 0.8306 1.8044 1.8791 0.2473 0.5565 0.7757 0.9280 0.1922 1.7221 3.3382 1.5893 2.0014 4.0224 2.9136 0.4682 0.1113 6.3888 1.4846 2.3192 12.1815 1.7441 3.3931 1.7924 2.5567 0.3824 10.1690 4.7087 2.2949 1.2729 16.4874 5.3222 10.0868 175.2777 21.4455 17.9565 4.4763 5.2595 1.1020 9.9464 24.4198 1.5380 37.8028 36.1677 15.7979 2.9255 93.4177 11.2900 21.0959 1.9005 40.7432 0.2939 61.9517 41.3433 21.3329 8.3719 4.6738 1.1875 3.6940 5.8202 99.0073 2.4110 2.6130 21.3855 87.4439 1.1353 23.6138 2.4464 0.1554 2.1926 27.1464 32.6167 109.9039 5.8647 1.2121 50.6974 4.4695 15.2311 0.1879 10.6357 25.0557 159.8878 29.5932 4.1508 8.7491 169.5701 52.5140 225.0614 30.5040 43.2571 68.5759 15.0967 32.2360 7.8016 21.5069 6.9166 11.9080 6.5159 283.7574 2.1528 65.2445 64.0219 170.2251 281.8408 161.2588 46.9887 5.0458 41.7196 73.2177 22.3433 1.2238 2.3047 14.9916 42.3380 4.4159 10.4155 4.0241 35.6309 16.4602 5.0833 25.1685 23.4892 16.9255 6.5880 29.1791 50.2719 209.0408 33.4058 21.4585 94.1657 110.2681 42.2936 242.9866 122.2813 4.0256 138.4534 24.1362 189.2832 47.0061 23.6486 5.1984 5.8143 17.8413 15.2051 9.9842 0.2082 6.9130 17.6990 1.5176 2.7212 2.2715 14.9878 14.0070 0.2124 8.1398 12.6913 5.2856 16.4479 45.5062 47.5229
temp: 298.150 k
press: 1.00000 atm
elementType: 16 8 8 8 8 8 8 8 6 6 6 6 6 6 6 6 6 6 6 6 6 6 6 6 6 6 6 6 6 6 6 6 6 6 1 1 1 1 1 1 1 1 1 1 1 1 1 1 1 1 1 1 1 1 1 1
symmnumber: 1
zpe: 1102883.0 jmol-1
zpe.correction: 0.420066 hartree
zpe.thermalcorrener: 0.450970 hartree
zpe.thermalcorrenthalpy: 0.451915 hartree
zpe.thermalcorrgfe: 0.351314 hartree
zpe.sumelectzpe: -1926.136416 hartree
zpe.sumelectthermal: -1926.105512 hartree
zpe.sumelectthermalent: -1926.104568 hartree
zpe.sumelectthermalfe: -1926.205168 hartree
dipole: 0.7138 1.5031 0.9620
dipole: 1.9221
quadrupole: -224.9774 -197.4637 -212.2348
quadrupole: 2.4949 -5.4436 -11.5898
quadrupole: -13.4188 14.0950 -0.6762 2.4949 -5.4436 -11.5898
hfenergy: -1926.5564824 hartree
pointgroup: C01 [X(C26H22O7S1)]
dipole: -0.2352067 -0.7126693 0.092856 debye
polarizability: 644.079669|54.9786107|267.6795893|-45.958167|29.4813233|218.978406 unknown
InChI: InChI=1S/C26H22O7S/c27-21(13-22(28)25(29)30)19-7-5-17(6-8-19)18-9-11-20(12-10-18)34-16-26(31)14-32-23-3-1-2-4-24(23)33-15-26/h1-12,29,31H,13-16H2
charge 0 multiplicity 1
56 atoms
S  -2.907606 0.223073 1.739001
O  -6.444324 -1.345921 -1.196982
O  -7.479289 0.494314 0.92091
O  -4.894402 1.849383 -0.191977
O  7.752695 2.420777 -0.948021
O  7.937728 -1.774607 -0.058473
O  10.220493 -0.893139 1.222697
O  10.802263 0.208886 -0.746276
C  -5.139255 0.414698 -0.005987
C  -5.850336 0.000272 -1.315146
C  -6.077865 0.13187 1.198114
C  -3.803144 -0.346292 0.148058
C  -7.773232 -1.390807 -0.702325
C  -8.266736 -0.505539 0.298663
C  -1.166081 0.377207 1.168751
C  -8.621136 -2.380456 -1.243418
C  -9.618061 -0.589545 0.698418
C  1.581778 0.648892 0.436528
C  -0.376702 1.408754 1.732637
C  -0.581873 -0.526488 0.249851
C  -9.964251 -2.476515 -0.820768
C  -10.46885 -1.566349 0.138868
C  0.978451 1.535823 1.371926
C  0.771396 -0.382027 -0.115036
C  3.011165 0.795949 0.051507
C  3.640209 2.076081 0.03718
C  3.795882 -0.335326 -0.310115
C  5.763236 1.080083 -0.694536
C  4.988622 2.215505 -0.321942
C  5.145574 -0.200823 -0.682961
C  7.190988 1.296597 -1.069832
C  8.01266 0.101878 -1.64671
C  8.553975 -0.795191 -0.541794
C  9.973613 -0.423556 -0.05566
H  -6.621456 0.755628 -1.547493
H  -5.132396 -0.064121 -2.148529
H  -5.78787 0.760371 2.056866
H  -6.023789 -0.935518 1.489138
H  -3.138879 -0.090596 -0.693809
H  -3.964864 -1.435003 0.19437
H  -4.236767 2.135789 0.499183
H  -8.210987 -3.048021 -2.007834
H  -9.971433 0.110994 1.461545
H  -0.820191 2.107765 2.449562
H  -1.170126 -1.345364 -0.177365
H  -10.614838 -3.245258 -1.250321
H  -11.513868 -1.62428 0.460311
H  1.578346 2.322805 1.841357
H  1.195349 -1.071625 -0.853065
H  3.055311 2.969676 0.280085
H  3.354953 -1.336651 -0.263918
H  5.470333 3.198683 -0.335082
H  5.725179 -1.098942 -0.917535
H  8.854293 0.541833 -2.203655
H  7.377647 -0.50431 -2.312648
H  11.148171 -0.655416 1.498289
