program: Gaussian 09
title: 000134100
version: EM64L-G09RevD.01
frameworkgroup: C1[X(C19H29IO2)]
method: RPBEPBE
basis: SDD
operation: Freq
keyword: #p
keyword: freq=noraman
keyword: PBEPBE/SDD
title: #p freq=noraman PBEPBE/SDD
converged: NO YES NO NO
title: Mulliken charges:
elementType: I O O C C C C C C C C C C C C C C C C C C C H H H H H H H H H H H H H H H H H H H H H H H H H H H H H
charge: 0.017132 -0.438599 -0.198339 -0.125982 -0.109970 -0.158053 0.396744 0.408647 -0.056876 -0.546489 -0.520234 -0.501297 -0.487622 -0.129284 -0.475561 -0.677855 -0.513826 -0.815875 -0.861740 -0.599102 -0.544644 0.176329 0.243859 0.194496 0.235343 0.212078 0.219905 0.218630 0.197009 0.229137 0.218234 0.205073 0.242510 0.257263 0.240605 0.202708 0.205878 0.325139 0.220679 0.223067 0.215765 0.262750 0.222427 0.227442 0.225025 0.223210 0.225912 0.240460 0.243852 0.229072 0.354969
chargesum: 0.00000
title: Mulliken charges with hydrogens summed into heavy atoms:
elementType: I O O C C C C C C C C C C C C C C C C C C C
charge: 0.017132 -0.083630 -0.198339 0.117878 0.084527 0.077290 0.396744 0.408647 0.155202 -0.107954 -0.094088 -0.077991 0.012151 0.111321 -0.066974 -0.352716 -0.070080 -0.114932 -0.186063 -0.132730 -0.071721 0.176329
polarizability: 2.93602989e+02 -8.15057312e+00 2.05579857e+02 -4.37452495e+00 1.47059693e+00 1.72010577e+02
1716.lowfreq: -5.9502 -4.9075 -0.0009 0.0001 0.0006 11.6673 25.5541 48.4422 58.3691
frequency: 25.2131 48.4231 58.3668 74.4430 87.3312 126.8642 141.2023 151.1983 162.1149 182.0111 205.0270 223.0487 232.9100 241.2591 255.1848 272.9241 288.3329 302.3033 311.2334 315.1021 336.0042 353.3156 366.3380 390.2217 393.0007 419.7210 426.1586 433.1778 450.4707 482.8797 499.3277 514.8230 519.0049 552.5995 562.1037 577.0861 622.3615 656.5146 672.9491 723.5620 750.9482 761.3752 799.3228 807.5420 836.3110 846.3387 875.7157 906.9834 911.5379 923.0756 933.0229 945.4276 952.3795 965.8640 974.4738 993.9630 1000.3290 1006.8138 1011.5838 1020.5607 1032.1675 1041.8947 1057.5597 1073.1461 1082.8363 1091.2955 1107.4231 1121.8791 1122.9299 1128.2420 1136.6112 1144.8550 1151.3036 1157.8285 1170.2776 1183.7083 1192.2835 1205.9393 1213.0771 1220.8561 1229.2358 1240.0089 1242.3215 1255.2721 1257.8206 1266.3623 1277.5103 1281.8807 1295.2905 1298.3833 1304.5846 1311.0609 1322.8762 1327.4954 1330.6146 1331.9419 1338.3352 1341.2803 1347.3829 1351.0195 1361.4020 1364.3560 1384.6803 1396.9712 1401.6081 1437.3563 1446.9051 1462.1321 1463.7563 1468.1681 1468.8587 1470.5378 1474.0609 1488.5739 1490.7230 1492.2735 1498.0167 1631.3286 2904.7450 2918.7171 2930.3997 2949.4610 2956.2062 2963.0226 2967.4141 2969.0518 2970.5094 2972.4814 2975.6516 2987.8751 2994.7225 2996.6853 2999.1993 3018.8853 3029.4410 3032.6733 3039.6192 3045.8460 3057.4556 3065.2734 3076.7334 3078.9570 3081.4762 3084.7638 3089.1443 3100.0070 3547.7956
redmass: 7.5743 6.9550 4.2644 4.5356 4.5057 2.8094 3.2190 3.9033 2.5048 1.7033 2.8518 1.7062 3.7025 2.0903 1.6561 2.5151 2.7111 2.7840 2.9009 2.5532 1.1562 2.8737 2.4017 2.8409 3.3888 3.1991 2.5042 2.8577 2.9718 2.5799 2.7655 3.1875 2.3969 2.4106 3.9809 3.6590 3.3036 2.9342 3.2291 2.6640 2.7647 2.0744 2.2409 2.8136 1.9183 2.1004 1.7458 1.8026 2.0340 1.8670 2.2052 1.8015 1.9528 2.1029 1.8590 2.0586 1.9562 2.3951 2.6499 2.1339 2.5848 2.9977 2.2947 2.2602 1.9152 2.1797 1.7275 1.6309 1.8847 1.9951 1.8737 1.5592 1.8565 1.4974 1.6167 1.6212 1.7112 1.5458 1.6354 1.7359 1.5724 1.4243 1.3101 1.4987 1.5840 1.4782 1.4991 1.4955 1.3482 1.3481 1.5448 1.4022 1.4098 1.4628 1.4410 1.4197 1.3612 1.3656 1.4500 1.4970 1.3567 1.4859 1.3218 1.2105 1.2576 1.0858 1.0834 1.0744 1.0857 1.0817 1.0870 1.0855 1.0852 1.0619 1.0590 1.0533 1.0566 9.3825 1.0811 1.0800 1.0815 1.0652 1.0822 1.0665 1.0741 1.0694 1.0619 1.0625 1.0626 1.0586 1.0376 1.0437 1.0609 1.0962 1.1021 1.0968 1.0983 1.1008 1.0967 1.0961 1.0967 1.0924 1.0966 1.0975 1.0923 1.0991 1.0658
irintensity: 0.9100 3.6269 0.1106 0.6787 1.3675 0.0596 2.2657 1.6178 1.7457 0.9494 1.0851 0.7419 0.8436 3.8015 2.0879 1.1539 3.2918 4.9686 2.1743 0.2205 144.4172 1.1376 1.3469 3.3263 2.2303 0.7353 2.0397 3.8737 0.5166 0.8945 4.1274 4.0356 0.6136 0.7602 3.2977 27.5258 1.9990 20.0367 4.0724 4.4531 9.3712 6.9853 0.2223 1.5927 4.4083 5.7340 4.4435 8.8970 4.9892 1.4276 1.7295 5.0354 19.0929 3.0533 11.8415 7.1901 4.6048 30.4488 34.1790 9.7687 20.3455 13.3115 8.6487 0.3838 12.4482 4.5734 11.5309 0.1361 2.2565 8.9691 10.6467 1.1202 8.8939 9.2378 38.1618 7.8608 9.3891 8.0837 19.1758 29.1291 17.2581 12.0166 7.4886 2.9291 10.3055 9.8794 5.1290 0.4887 3.8437 0.2491 22.8173 3.4747 0.2955 0.6468 2.6095 0.9125 1.7748 0.5448 0.7293 0.8877 1.1321 0.5994 6.6867 12.1395 32.4973 20.5321 11.9890 4.9354 11.0190 2.4779 14.8022 23.0889 2.2528 5.1195 6.1421 2.0073 13.8611 222.3261 7.9194 9.4891 16.2562 20.4842 15.6618 31.7644 22.8391 42.6702 11.0963 13.6381 62.0582 17.5151 21.3518 15.3257 27.6300 46.4595 43.7959 20.9981 77.3007 35.9744 25.2876 28.0359 39.1444 0.7352 37.5727 35.9707 14.3002 22.0552 5.1076
temp: 298.150 k
press: 1.00000 atm
elementType: 53 8 8 6 6 6 6 6 6 6 6 6 6 6 6 6 6 6 6 6 6 6 1 1 1 1 1 1 1 1 1 1 1 1 1 1 1 1 1 1 1 1 1 1 1 1 1 1 1 1 1
symmnumber: 1
zpe: 1163203.2 jmol-1
zpe.correction: 0.443041 hartree
zpe.thermalcorrener: 0.464481 hartree
zpe.thermalcorrenthalpy: 0.465425 hartree
zpe.thermalcorrgfe: 0.393107 hartree
zpe.sumelectzpe: -901.661217 hartree
zpe.sumelectthermal: -901.639777 hartree
zpe.sumelectthermalent: -901.638833 hartree
zpe.sumelectthermalfe: -901.711151 hartree
dipole: 1.1672 1.4693 1.6987
dipole: 2.5312
quadrupole: -190.5740 -154.3975 -148.1585
quadrupole: -11.7021 -13.8777 -4.8048
quadrupole: -26.1973 9.9792 16.2182 -11.7021 -13.8777 -4.8048
hfenergy: -902.1042577 hartree
pointgroup: C01 [X(C19H29I1O2)]
dipole: 0.5832744 -0.3864114 -0.7086434 debye
polarizability: 288.0404256|18.917747|208.0248608|14.580177|9.393458|175.1281365 unknown
InChI: InChI=1S/C19H29IO2/c1-18-7-5-12(21)9-11(18)3-4-13-14(18)6-8-19(2)15(13)10-16(20)17(19)22/h11,13-17,22H,3-10H2,1-2H3
charge 0 multiplicity 1
51 atoms
I  5.695181 1.892494 1.16829
O  4.846248 -1.65829 0.185367
O  -5.925796 0.482711 1.06244
C  0.401894 0.595143 -0.461572
C  -0.482095 -0.475041 0.268717
C  1.832565 0.511034 0.105319
C  2.482827 -0.895305 -0.092788
C  -1.983441 -0.445516 -0.220451
C  -2.519172 1.016314 0.003576
C  0.157645 -1.894987 0.238293
C  1.642053 -1.924648 0.69635
C  -0.197226 2.013093 -0.296934
C  2.909781 1.51669 -0.394423
C  3.889343 -0.605306 0.503542
C  -1.675313 2.077188 -0.737456
C  4.252064 0.771133 -0.128327
C  -2.845296 -1.391243 0.673335
C  2.62143 -1.320929 -1.578725
C  -2.105343 -0.884846 -1.705902
C  -4.031154 1.16042 -0.325958
C  -4.373306 -1.289233 0.408327
C  -4.881341 0.150404 0.439321
H  0.441017 0.360552 -1.546181
H  -0.507353 -0.160416 1.339865
H  1.742812 0.660309 1.206335
H  -2.40508 1.218623 1.09342
H  0.087201 -2.32007 -0.780894
H  -0.419006 -2.572537 0.895308
H  1.697629 -1.683114 1.778885
H  2.054587 -2.943914 0.57118
H  0.402206 2.744633 -0.873126
H  -0.123569 2.311299 0.771014
H  2.808349 1.720058 -1.478208
H  2.848023 2.484821 0.126534
H  3.788439 -0.494376 1.605298
H  -2.087289 3.085114 -0.531775
H  -1.75321 1.924354 -1.833244
H  4.850262 0.620443 -1.040818
H  -2.65034 -1.14991 1.738746
H  -2.540935 -2.443664 0.522768
H  3.088063 -0.537061 -2.202343
H  3.261179 -2.217468 -1.641754
H  1.642684 -1.558704 -2.027435
H  -1.455001 -0.29421 -2.373459
H  -1.83036 -1.948196 -1.826535
H  -3.138086 -0.775668 -2.081721
H  -4.188207 1.004013 -1.413598
H  -4.389432 2.177897 -0.087008
H  -4.946077 -1.883001 1.142096
H  -4.598795 -1.70426 -0.596016
H  5.693637 -1.476227 0.667324
