program: Gaussian 09
title: 000134087
version: EM64L-G09RevD.01
frameworkgroup: C1[X(C16H20N2O10)]
method: RPBEPBE
basis: SDD
operation: Freq
keyword: #p
keyword: freq=noraman
keyword: PBEPBE/SDD
title: #p freq=noraman PBEPBE/SDD
converged: YES YES NO NO
title: Mulliken charges:
elementType: O O O O O O O O O O N N C C C C C C C C C C C C C C C C H H H H H H H H H H H H H H H H H H H H
charge: -0.448945 -0.513287 -0.418823 -0.416268 -0.396190 -0.409390 -0.223284 -0.231878 -0.273731 -0.234124 -0.124524 -0.146889 -0.504426 -0.571049 0.347777 0.436913 -0.090465 -0.011396 -0.356809 -0.475017 -0.435054 -0.417121 -0.448662 -0.425743 0.190236 0.185206 0.257682 0.194705 0.250605 0.241684 0.222927 0.245688 0.281341 0.230794 0.231071 0.288573 0.233762 0.285647 0.251809 0.286521 0.240212 0.297575 0.393929 0.443574 0.378935 0.379835 0.391274 0.384798
chargesum: 0.00000
title: Mulliken charges with hydrogens summed into heavy atoms:
elementType: O O O O O O O O O O N N C C C C C C C C C C C C C C C C
charge: -0.055016 -0.069713 -0.039888 -0.036433 -0.004916 -0.024591 -0.223284 -0.231878 -0.273731 -0.234124 -0.124524 -0.146889 -0.012137 -0.102435 0.347777 0.436913 -0.090465 -0.011396 -0.075467 -0.244223 0.084591 0.102288 0.089669 0.112044 0.190236 0.185206 0.257682 0.194705
polarizability: 2.94114369e+02 -2.81823909e+00 1.84236646e+02 3.50450399e+00 -3.56067845e+00 1.93272942e+02
1716.lowfreq: -7.8738 -3.1776 -0.0007 -0.0004 -0.0001 2.5152 6.3092 12.4809 15.9484
frequency: 3.3268 12.3554 15.4753 23.5679 31.5191 35.2344 37.0152 44.4776 47.4812 55.0024 74.6855 83.2070 96.5482 110.7374 135.5909 152.5982 158.5038 164.1094 198.6738 213.1078 241.1552 272.2307 280.0977 285.4611 292.3360 298.4031 307.5520 320.5902 323.1344 339.4229 354.3926 424.3942 449.6769 467.5320 478.1981 484.5274 492.2564 499.3284 504.0554 516.7428 535.0941 555.7954 571.0528 579.4654 584.6207 603.1344 618.6060 622.0252 625.5141 631.1714 638.3084 642.8644 649.9894 693.7496 714.1128 748.5510 780.3970 810.1586 823.6508 831.1216 860.5600 861.3960 884.1343 889.1273 930.2511 944.2439 960.6753 971.1102 973.0916 979.3812 981.2552 992.1810 1030.2421 1045.8240 1048.3515 1049.5305 1072.3483 1132.4354 1138.4263 1160.4709 1172.7570 1177.6345 1198.0685 1221.2642 1228.3612 1238.3132 1242.4361 1244.5255 1248.7334 1252.2795 1259.3033 1269.7908 1283.1713 1289.2013 1293.3211 1310.0681 1345.8312 1373.6662 1377.1546 1380.3915 1382.7965 1383.2262 1387.0804 1413.4088 1426.7760 1430.7699 1441.3966 1445.5985 1462.5053 1474.3237 1479.2599 1505.3332 1594.2809 1637.5898 1650.7881 1670.2644 1673.4915 1680.3474 2846.9627 2869.8815 2871.8070 2895.2391 2904.9411 2929.5563 3002.1327 3036.1739 3037.6914 3038.9813 3053.5574 3063.0146 3120.2193 3162.2904 3194.0341 3451.6005 3515.8615 3516.1874 3519.0916 3520.5985
redmass: 8.0161 7.7219 6.6420 7.4420 7.0746 9.8861 7.0473 11.0532 10.5220 6.6833 5.1490 10.8567 5.7375 5.7616 7.2281 5.0552 3.6542 4.1815 4.0089 4.5170 3.3676 3.2409 3.0398 4.8276 4.0280 5.1544 3.7886 4.5551 3.6621 3.7238 5.3271 3.6916 2.9273 4.6470 3.2325 2.3497 2.1546 2.1580 2.3632 4.4101 4.7417 3.5031 3.9600 1.2099 4.0879 3.8596 2.5635 4.2345 2.2774 1.4734 1.6214 2.1096 1.8387 1.4538 4.4876 2.9426 5.3213 1.7084 3.5037 3.3309 3.9744 4.0075 4.1157 3.9888 3.8142 1.5941 1.9987 2.4396 2.1192 2.2663 2.2501 2.1175 2.6470 2.4531 2.3904 2.3862 2.3099 2.2393 2.3252 1.4725 1.4140 1.6637 2.1110 1.6137 1.4227 1.5389 1.4005 1.4837 1.4008 1.6575 1.7549 1.6856 1.8155 1.9644 1.8766 1.9787 1.5761 1.6369 1.5149 1.7521 1.5842 1.6068 1.5686 4.0902 1.1440 1.0937 1.1264 1.1421 2.5376 1.1078 1.2654 3.1187 7.9213 6.6943 8.1302 8.2557 8.3022 8.3566 1.0710 1.0708 1.0706 1.0695 1.0705 1.0692 1.0899 1.0849 1.0850 1.0894 1.0848 1.0869 1.0891 1.0949 1.0723 1.0638 1.0642 1.0641 1.0642 1.0641
irintensity: 0.5419 0.6185 0.4328 1.3839 0.3857 0.6193 0.3744 0.3627 0.5625 0.8157 3.5152 0.7740 3.2274 2.5685 3.7683 3.1308 0.5444 1.6350 6.3738 6.2007 1.6086 7.0030 8.0055 5.0845 3.8729 2.6101 0.3724 3.0426 16.5321 1.0912 3.8165 2.2347 7.0848 20.9972 30.5560 26.8480 45.7251 28.1505 23.1617 20.9716 37.4599 3.5760 20.4292 118.2885 51.3219 24.5181 47.9843 35.5570 47.1960 134.4767 113.3776 35.7402 116.1114 139.0714 18.6264 53.5864 13.9820 37.6886 15.8807 12.7998 2.6385 2.0863 18.0012 0.1819 29.4545 40.9578 46.6315 15.6940 101.0998 22.8627 29.5896 119.8262 417.3171 82.1825 143.8717 350.7766 270.2242 37.8967 40.5902 16.9091 1.4737 5.3851 120.1935 30.3966 12.0386 121.7986 21.2444 7.1463 23.3332 34.7024 43.7805 51.2172 14.7652 43.2643 55.3919 55.5765 80.5886 45.5155 20.5885 12.0218 13.0673 23.5605 22.8393 23.0233 42.0292 22.3109 21.1528 31.4925 45.7031 6.0207 14.1905 0.7920 29.8461 8.4502 303.8431 256.8641 169.2724 223.9595 69.4182 69.7126 96.4986 49.2737 93.5554 39.4885 19.3879 2.4195 10.2467 14.8109 10.0827 2.1818 10.3437 3.2434 1363.5719 71.9798 46.4641 24.7157 31.2809 29.6854
temp: 298.150 k
press: 1.00000 atm
elementType: 8 8 8 8 8 8 8 8 8 8 7 7 6 6 6 6 6 6 6 6 6 6 6 6 6 6 6 6 1 1 1 1 1 1 1 1 1 1 1 1 1 1 1 1 1 1 1 1
symmnumber: 1
zpe: 942564.4 jmol-1
zpe.correction: 0.359004 hartree
zpe.thermalcorrener: 0.387875 hartree
zpe.thermalcorrenthalpy: 0.388820 hartree
zpe.thermalcorrgfe: 0.291588 hartree
zpe.sumelectzpe: -1481.327378 hartree
zpe.sumelectthermal: -1481.298506 hartree
zpe.sumelectthermalent: -1481.297562 hartree
zpe.sumelectthermalfe: -1481.394794 hartree
dipole: 4.3595 1.9673 -0.9969
dipole: 4.8856
quadrupole: -136.0097 -146.8597 -163.8273
quadrupole: -2.7964 -13.8459 2.3963
quadrupole: 12.8892 2.0392 -14.9284 -2.7964 -13.8459 2.3963
hfenergy: -1481.6863815 hartree
pointgroup: C01 [X(C16H20N2O10)]
dipole: 1.7375827 -0.7789391 0.2621577 debye
polarizability: 293.7892926|5.6078706|185.4849879|-4.6595935|-4.7482375|192.3496765 unknown
InChI: InChI=1S/C16H20N2O10/c19-11(20)5-17(6-12(21)22)3-9-1-2-10(16(28)15(9)27)4-18(7-13(23)24)8-14(25)26/h1-2,19,21,23,25,27-28H,3-8H2
charge 0 multiplicity 1
48 atoms
O  -0.408174 1.733656 -2.245556
O  2.039425 1.61074 -1.317242
O  -6.913815 1.38276 0.652772
O  -3.088277 -3.619718 -1.030144
O  6.773913 1.560241 0.139229
O  3.06656 -3.575244 -0.46938
O  -4.866803 1.590505 1.731313
O  -4.549265 -2.670471 0.503361
O  4.692361 1.90269 -0.803161
O  4.512608 -1.943713 -1.272458
N  -3.633862 -0.018805 -0.330528
N  3.562013 -0.125708 0.766077
C  -2.79236 1.163359 -0.667338
C  2.681783 0.798821 1.534536
C  -1.381509 1.031835 -0.114464
C  1.278348 0.864821 0.959545
C  -0.257904 1.336471 -0.909206
C  1.064279 1.256488 -0.383059
C  -1.163678 0.638832 1.232207
C  0.141131 0.553664 1.754802
C  -5.074965 0.237829 -0.361479
C  -3.202604 -1.230158 -1.031864
C  4.993756 0.124106 0.899636
C  3.123188 -1.520135 0.75362
C  -5.537175 1.127452 0.787719
C  -3.707312 -2.523612 -0.407079
C  5.42713 1.270674 -0.007371
C  3.658412 -2.3075 -0.436702
H  -2.747845 1.347674 -1.764291
H  -3.271423 2.043622 -0.201861
H  2.622029 0.513194 2.611522
H  3.15842 1.798305 1.495304
H  -2.040268 0.398765 1.841931
H  0.293648 0.25146 2.798139
H  -5.440563 0.703247 -1.310659
H  -5.618807 -0.715978 -0.241867
H  -3.484878 -1.260054 -2.116305
H  -2.098077 -1.26795 -1.011435
H  5.327911 0.363741 1.936759
H  5.572458 -0.757831 0.575128
H  3.386596 -2.097313 1.675018
H  2.019482 -1.535547 0.694336
H  0.510862 1.891286 -2.601648
H  2.999893 1.521185 -1.018838
H  -7.21657 1.939999 1.419933
H  -3.434492 -4.461433 -0.62662
H  7.038211 2.290987 -0.483405
H  3.421407 -4.088938 -1.244824
