program: Gaussian 09
title: 000134154
version: EM64L-G09RevD.01
frameworkgroup: C1[X(C18H11F3I3N3O5)]
method: RPBEPBE
basis: SDD
operation: Freq
keyword: #p
keyword: freq=noraman
keyword: PBEPBE/SDD
title: #p freq=noraman PBEPBE/SDD
converged: YES YES NO NO
title: Mulliken charges:
elementType: I I I F F F O O O O O N N N C C C C C C C C C C C C C C C C C C H H H H H H H H H H H
charge: 0.163727 0.162416 0.128811 -0.163079 -0.138894 -0.140489 -0.279641 -0.402440 -0.208170 -0.197303 -0.419851 -0.367212 0.014832 0.012803 -0.613502 -0.170154 0.533968 -0.380337 -0.324800 0.175960 0.524659 -0.495900 -0.472161 0.197247 0.002181 0.335009 -0.223910 -0.347015 0.328337 -0.520708 -0.334649 0.430906 0.243757 0.248695 0.283534 0.341743 0.259588 0.265214 0.394948 0.299693 0.260677 0.229761 0.361744
chargesum: 0.00000
title: Mulliken charges with hydrogens summed into heavy atoms:
elementType: I I I F F F O O O O O N N N C C C C C C C C C C C C C C C C C C
charge: 0.163727 0.162416 0.128811 -0.163079 -0.138894 -0.140489 -0.279641 -0.007492 -0.208170 -0.197303 -0.058106 -0.025468 0.014832 0.012803 -0.121049 0.113381 0.533968 -0.120748 -0.059587 0.175960 0.524659 -0.495900 -0.472161 0.197247 0.002181 0.335009 0.075783 -0.086337 0.328337 -0.520708 -0.104887 0.430906
polarizability: 3.95347742e+02 1.13399242e+00 2.73598735e+02 -6.43609055e+00 1.41761769e+01 2.80689954e+02
1716.lowfreq: -5.8561 -3.7627 -2.2837 -0.0005 -0.0003 0.0005 6.8389 11.7949 14.0289
frequency: 5.9892 11.7813 13.8496 18.4907 22.2684 28.7868 35.8818 39.6559 40.9125 46.5876 54.6242 79.2701 80.8669 97.2537 109.5587 116.8155 141.5881 144.6338 151.3591 155.8480 157.6854 169.7054 178.3538 186.5357 203.9668 222.7343 237.3856 247.0766 304.6926 313.3692 318.9345 322.4190 340.7367 354.3101 360.4420 366.7248 403.0191 426.3661 435.8356 442.2618 454.2020 473.7824 480.7688 493.3933 501.7211 509.4176 514.7812 530.4497 556.3645 568.4851 587.4748 607.2275 621.3155 640.9192 650.5371 670.8523 680.4449 688.9091 692.1344 701.9030 711.3528 743.0990 758.1808 794.9314 798.0367 852.0879 866.3152 874.4240 886.4145 887.6599 896.7424 922.9363 935.6087 954.5017 994.4296 1011.4161 1012.7158 1029.4741 1031.9443 1047.1083 1102.6842 1110.4428 1146.8050 1168.0540 1190.6936 1195.4573 1199.9849 1205.7408 1228.6249 1231.5245 1257.9430 1281.5593 1290.6606 1319.2717 1320.1171 1330.7039 1347.2264 1361.7287 1379.1769 1380.1341 1398.8750 1422.9235 1446.3090 1471.5524 1482.9421 1535.3561 1577.3432 1579.8195 1608.8841 1617.5472 1664.9709 2044.1528 3001.6371 3064.8551 3098.5729 3124.9286 3153.5434 3164.7930 3177.5374 3178.6354 3461.2421 3508.2734 3586.1583
redmass: 19.6922 41.8936 15.8026 15.7076 8.8537 13.3398 13.2272 18.6728 15.9797 14.7373 13.5417 10.5362 14.7253 13.6068 7.3645 9.5060 6.2557 8.7785 11.5364 13.5720 10.4325 5.4222 7.1119 8.9240 6.1561 9.9027 8.8582 5.8804 10.8562 7.5440 6.2114 1.1220 6.0420 12.8464 3.8009 6.5841 7.0618 8.4033 3.1998 5.5442 7.7663 10.7063 11.7938 5.1028 7.3931 5.9317 5.8934 7.9916 3.6271 6.2451 2.7911 1.7247 5.7737 4.3848 5.1016 5.3660 3.6131 5.3217 8.0653 4.0252 5.1592 2.6578 7.9967 1.4859 6.3873 6.4305 2.2716 1.9711 1.4127 4.0590 1.4186 1.3432 3.6706 6.9938 12.8061 3.6344 3.2977 11.4304 3.9168 2.5866 2.6358 1.4591 1.2464 2.5765 1.5966 6.7692 1.5217 1.6727 1.3648 5.0460 2.9912 1.4344 1.6374 5.1680 1.3917 4.2273 6.3804 2.4543 4.3020 2.3588 4.9902 3.9435 1.4750 1.1395 2.7629 7.6286 6.7833 7.3565 4.8337 7.3296 8.9928 13.8783 1.0609 1.1008 1.0866 1.0901 1.0924 1.0929 1.0927 1.0944 1.0743 1.0643 1.0661
irintensity: 0.4954 0.1032 0.2934 0.6448 1.1865 0.5129 1.0551 0.4794 0.1062 0.1467 0.0795 0.4080 0.0964 0.0157 0.0417 0.6850 5.7329 1.9081 0.8511 0.1502 0.5662 0.0840 0.5811 3.4671 1.0636 0.0677 1.2733 2.9683 4.2155 1.8542 6.7143 124.9262 0.8504 0.1789 2.9274 7.8236 10.7131 5.5960 11.2272 6.6941 11.7208 3.4991 5.8858 0.2914 6.8165 2.8176 4.2434 13.4685 4.4359 46.1388 1.9725 126.7953 30.4020 59.2652 3.6834 14.9870 32.4215 7.5930 44.2007 1.3582 31.6276 112.7129 38.2161 46.4453 21.6601 15.8383 26.1303 25.9783 16.3685 42.1550 5.7871 0.0613 18.0916 80.3099 200.0223 14.0223 40.3484 219.9297 17.1652 214.7393 58.3678 185.4805 119.5280 27.4503 9.4386 69.8462 7.4361 53.1099 7.1466 205.7686 4.7508 65.7638 23.9032 312.6071 4.4224 141.8284 8.0307 86.2456 80.0729 34.5938 12.0315 182.2425 3.0441 13.7802 182.7378 64.9547 24.9272 30.2155 360.2062 6.6942 219.9898 299.9594 16.7073 5.9976 3.5365 16.7834 1.8558 2.1780 5.2777 9.0027 56.2712 39.5546 50.4821
temp: 298.150 k
press: 1.00000 atm
elementType: 53 53 53 9 9 9 8 8 8 8 8 7 7 7 6 6 6 6 6 6 6 6 6 6 6 6 6 6 6 6 6 6 1 1 1 1 1 1 1 1 1 1 1
symmnumber: 1
zpe: 696480.4 jmol-1
zpe.correction: 0.265275 hartree
zpe.thermalcorrener: 0.297759 hartree
zpe.thermalcorrenthalpy: 0.298703 hartree
zpe.thermalcorrgfe: 0.191078 hartree
zpe.sumelectzpe: -1564.574610 hartree
zpe.sumelectthermal: -1564.542126 hartree
zpe.sumelectthermalent: -1564.541182 hartree
zpe.sumelectthermalfe: -1564.648807 hartree
dipole: 1.5937 -5.9428 -2.3844
dipole: 6.5986
quadrupole: -202.6606 -242.9642 -221.6484
quadrupole: 27.4008 27.9624 2.6357
quadrupole: 19.7638 -20.5398 0.7760 27.4008 27.9624 2.6357
hfenergy: -1564.839885 hartree
pointgroup: C01 [X(C18H11F3I3N3O5)]
dipole: 1.04042 2.1442248 1.0293608 debye
polarizability: 383.373172|-30.2816414|281.6546264|23.9953597|8.3186548|284.608633 unknown
InChI: InChI=1S/C18H11F3I3N3O5/c19-18(20,21)15(27-25)16(29)26-12(17(30)31)5-7-3-10(23)14(11(24)4-7)32-8-1-2-13(28)9(22)6-8/h1-4,6,12,26,28,30H,5H2
charge 0 multiplicity 1
43 atoms
I  2.343151 0.959609 -3.180144
I  3.048139 2.234324 2.805917
I  2.118672 -3.865074 1.250187
F  -2.571328 -3.201251 0.958261
F  -2.81468 -3.418272 -1.28471
F  -4.498066 -2.5337 -0.062858
O  3.71351 1.262822 -0.241128
O  -4.346231 2.63334 1.83708
O  -5.024489 2.890003 -0.378411
O  -3.721208 -0.689814 -2.339493
O  5.263963 -4.091614 0.655922
N  -2.932797 1.141159 -1.147688
N  -1.388347 -0.934581 0.30947
N  -0.375747 -0.691063 0.862747
C  -1.775476 3.040261 0.044979
C  -2.822442 1.872599 0.124422
C  -0.334775 2.565028 -0.037433
C  0.488024 2.592021 1.115953
C  0.20982 2.098533 -1.260503
C  -4.187539 2.500107 0.460478
C  2.364919 1.644747 -0.159277
C  1.542667 1.64185 -1.317018
C  1.822858 2.141084 1.054053
C  -3.109285 -0.232342 -1.334099
C  -2.522277 -1.178399 -0.32928
C  4.057864 -0.10463 -0.007247
C  3.116751 -1.068467 0.41142
C  5.410498 -0.440738 -0.208069
C  -3.09563 -2.55892 -0.198838
C  3.543375 -2.395005 0.624066
C  5.823093 -1.768439 0.012236
C  4.896874 -2.759875 0.428068
H  -2.033323 3.661659 -0.833828
H  -1.910452 3.669919 0.942562
H  -2.551465 1.191187 0.944388
H  -3.372402 1.682855 -1.904542
H  0.088288 2.96917 2.062319
H  -0.404758 2.092952 -2.16483
H  -5.214806 3.073677 2.046614
H  2.07163 -0.797411 0.574978
H  6.116053 0.328819 -0.531536
H  6.874894 -2.04023 -0.142235
H  6.227979 -4.2293 0.482347
