program: Gaussian 09
title: 000134090
version: EM64L-G09RevD.01
frameworkgroup: C1[X(C14H19N5O5)]
method: RPBEPBE
basis: SDD
operation: Freq
keyword: #p
keyword: freq=noraman
keyword: PBEPBE/SDD
title: #p freq=noraman PBEPBE/SDD
converged: YES YES NO NO
title: Mulliken charges:
elementType: O O O O O N N N N N C C C C C C C C C C C C C C H H H H H H H H H H H H H H H H H H H
charge: -0.311147 -0.297246 -0.318204 -0.447957 -0.226753 -0.328768 -0.361680 -0.349954 -0.416783 -0.080454 -0.212255 -0.485945 -0.516370 -0.217043 0.264962 0.190366 -0.586196 0.270017 0.406524 -0.146902 -0.480151 -0.688341 -0.245133 0.196342 0.279735 0.218210 0.265093 0.257887 0.269544 0.308205 0.345332 0.324621 0.233635 0.229965 0.359740 0.281798 0.364920 0.258539 0.255031 0.236446 0.217690 0.255956 0.426727
chargesum: 0.00000
title: Mulliken charges with hydrogens summed into heavy atoms:
elementType: O O O O O N N N N N C C C C C C C C C C C C C C
charge: -0.311147 -0.297246 -0.318204 -0.021230 -0.226753 0.016563 -0.037059 0.009786 -0.051863 -0.080454 0.067480 -0.002642 0.011061 0.091162 0.264962 0.190366 -0.122596 0.270017 0.406524 0.134897 -0.221613 0.020825 0.010823 0.196342
polarizability: 2.29017150e+02 2.41604181e-03 2.01873727e+02 3.16689543e+00 -6.83308631e+00 1.53394440e+02
1716.lowfreq: -8.1658 -5.7475 -0.0012 -0.0008 -0.0007 5.1669 9.5243 18.8058 36.2664
frequency: -7.1865 18.5363 36.2510 49.3193 56.1551 78.3813 82.6108 101.3382 102.1088 106.1995 128.3306 141.9845 154.7601 168.2260 203.9585 222.4664 227.4773 251.9860 257.2794 295.9784 306.0414 325.5803 349.8117 360.6589 408.7757 422.5633 435.0080 460.8290 517.8733 534.1916 558.3511 576.7230 580.9315 610.5771 635.6944 647.1764 655.5607 669.3110 680.7528 706.1566 725.5416 750.3748 784.9458 788.0703 793.8629 802.3626 810.4379 814.6417 816.6249 840.5665 863.0645 869.0238 894.7412 900.9799 914.8642 951.8169 961.0391 991.7749 997.0024 1019.1088 1025.0664 1061.3796 1076.2569 1087.2566 1093.8063 1095.3074 1110.6836 1115.9997 1148.3138 1150.4197 1181.2796 1184.1325 1228.2987 1233.5408 1236.2736 1248.6508 1255.1460 1267.6475 1280.4234 1284.4279 1297.4289 1301.2286 1318.1893 1319.4761 1324.5597 1335.7125 1341.1343 1355.1540 1370.7643 1388.0015 1388.5897 1432.1642 1450.8244 1453.1814 1472.0283 1477.4620 1480.5044 1503.8147 1528.1332 1556.0909 1574.0040 1615.2852 1635.0088 1656.8808 2977.7191 2996.9176 3020.7391 3030.0499 3033.5123 3034.7178 3046.5901 3058.7670 3079.5472 3096.1966 3097.3530 3117.3447 3218.1236 3240.5709 3241.5179 3353.7576 3447.8090 3544.3725 3546.7227
redmass: 7.0076 6.7650 6.4988 4.8792 5.8442 4.4227 3.7768 6.8422 8.1889 5.9182 6.2180 8.3662 4.7994 3.3118 4.6464 1.2879 2.6465 5.2120 5.0796 6.1666 3.2574 2.8699 4.9540 4.5731 4.6760 5.0934 4.9909 4.6310 2.0979 3.6564 4.1004 1.8974 2.1851 3.6437 3.7967 3.9934 3.6756 2.8064 4.5454 1.8640 4.3041 4.9860 2.6713 1.4090 1.4610 4.4442 1.5767 1.4002 1.2856 1.1960 4.5643 2.4344 2.4659 5.0703 1.9919 2.5784 3.0209 2.2939 3.3847 2.5239 2.2252 3.0089 2.9750 1.8708 2.0705 2.1087 2.7350 1.8851 1.3464 1.8903 1.4878 1.4532 1.5985 1.6661 2.3892 1.8593 1.5824 1.5128 1.3925 1.4438 2.2061 1.9323 1.5367 1.3077 1.3298 1.7551 1.4603 2.2161 4.1816 2.1280 1.2068 2.8255 1.1193 1.0915 1.0537 1.0579 1.5851 1.2896 1.8220 4.9405 6.3747 5.1752 8.7687 8.7349 1.0638 1.0366 1.0633 1.0664 1.0826 1.0842 1.0839 1.0970 1.1013 1.0994 1.1006 1.1010 1.0980 1.0993 1.0685 1.0821 1.0848 1.0774 1.0782
irintensity: 3.5922 0.9248 1.0309 0.4077 0.1907 4.3001 1.8245 5.4870 2.2343 0.3119 1.0851 30.7555 21.8087 0.8273 3.5830 2.6701 4.2146 4.4216 9.5319 10.6169 9.7186 2.4371 2.6515 0.9611 9.5370 17.5380 31.6999 0.6484 12.6281 25.8164 53.7706 54.8988 43.9884 12.5644 20.5597 2.2275 23.2082 103.4147 5.5103 139.0258 3.6524 10.3828 25.7092 48.3085 104.9355 4.8938 8.8324 10.7771 112.4879 166.9623 3.5505 16.8241 2.3868 13.2137 5.3013 4.1525 0.8595 20.0240 9.6500 8.3117 228.9636 15.2682 76.5908 90.2608 70.3407 6.6938 18.3853 17.3170 28.5644 48.1752 2.2402 4.0824 23.3200 21.6866 26.9051 20.2559 21.8675 40.5095 4.1159 11.5605 28.0394 2.7579 15.4531 5.7492 8.0409 15.0632 1.5731 55.6909 31.9050 39.3603 25.4219 14.1720 7.1684 21.8975 14.5210 14.5697 159.0638 110.4664 237.5170 34.7782 49.7728 277.7100 663.4973 51.0668 28.5036 17.2829 11.8497 12.5824 7.1428 4.3434 20.8196 11.0398 9.1229 19.4029 22.2051 11.6106 6.2337 1.4653 404.9182 154.0564 270.6355 21.9761 36.9409
temp: 298.150 k
press: 1.00000 atm
elementType: 8 8 8 8 8 7 7 7 7 7 6 6 6 6 6 6 6 6 6 6 6 6 6 6 1 1 1 1 1 1 1 1 1 1 1 1 1 1 1 1 1 1 1
symmnumber: 1
zpe: 888460.6 jmol-1
zpe.correction: 0.338397 hartree
zpe.thermalcorrener: 0.360304 hartree
zpe.thermalcorrenthalpy: 0.361248 hartree
zpe.thermalcorrgfe: 0.286130 hartree
zpe.sumelectzpe: -1193.032033 hartree
zpe.sumelectthermal: -1193.010127 hartree
zpe.sumelectthermalent: -1193.009182 hartree
zpe.sumelectthermalfe: -1193.084300 hartree
dipole: -3.4445 -5.4912 0.5819
dipole: 6.5082
quadrupole: -187.5751 -129.2719 -145.0855
quadrupole: 26.2481 -11.3067 9.5643
quadrupole: -33.5976 24.7056 8.8920 26.2481 -11.3067 9.5643
hfenergy: -1193.3704302 hartree
pointgroup: C01 [X(C14H19N5O5)]
dipole: -2.3424718 -0.9937858 0.2853596 debye
polarizability: 219.7707253|-12.9177729|211.3399169|-4.4668576|-4.7589357|153.1746745 unknown
InChI: InChI=1S/C14H19N5O5/c1-7(14(23)24)17-13(22)10(4-8-5-15-6-16-8)19-12(21)9-2-3-11(20)18-9/h5-7,9-10,16-19,23H,2-4H2,1H3
charge 0 multiplicity 1
43 atoms
O  -0.985877 -0.098044 1.964446
O  -3.50079 2.604079 -1.087105
O  1.885714 0.063951 -1.641464
O  -0.881243 2.576144 -0.427764
O  0.421942 4.452869 -0.870712
N  -3.341434 1.006981 0.636926
N  -0.833764 -1.228557 -0.054085
N  1.13801 1.041369 0.34137
N  3.556113 -2.153608 -1.346021
N  4.606154 -3.907902 -0.37905
C  -3.083969 -0.443743 0.77976
C  -3.794094 -1.01855 -0.484766
C  -3.801436 0.147289 -1.511219
C  0.648178 -1.346251 -0.004225
C  -1.549511 -0.60794 0.936759
C  -3.55842 1.40729 -0.668412
C  1.088588 -2.575792 -0.838733
C  1.289502 -0.017039 -0.514882
C  2.54936 -2.920777 -0.74254
C  1.515582 2.411153 -0.026767
C  3.222754 -4.001521 -0.156904
C  2.254992 3.130732 1.125512
C  4.769513 -2.77638 -1.099617
C  0.31466 3.26738 -0.491912
H  -3.528857 -0.828699 1.713657
H  -3.329538 -1.945522 -0.862017
H  -4.829163 -1.278687 -0.206867
H  -2.992892 0.08316 -2.262646
H  -4.749499 0.235953 -2.065486
H  0.923458 -1.482643 1.05758
H  -2.999331 1.662526 1.344407
H  -1.301081 -1.55011 -0.904218
H  0.508081 -3.446126 -0.482918
H  0.813284 -2.39351 -1.897651
H  0.566996 0.88844 1.189109
H  2.186136 2.333369 -0.902681
H  3.35356 -1.261871 -1.815777
H  2.800405 -4.836166 0.39979
H  2.502974 4.160544 0.821039
H  3.185266 2.591721 1.370414
H  1.627843 3.178898 2.034382
H  5.722965 -2.388659 -1.449773
H  -1.692231 3.081449 -0.755843
