program: Gaussian 09
title: 000134030
version: EM64L-G09RevD.01
frameworkgroup: C1[X(C10H13N3S)]
method: RPBEPBE
basis: SDD
operation: Freq
keyword: #p
keyword: freq=noraman
keyword: PBEPBE/SDD
title: #p freq=noraman PBEPBE/SDD
converged: YES YES NO NO
title: Mulliken charges:
elementType: S N N N C C C C C C C C C C H H H H H H H H H H H H H
charge: 0.159508 -0.481068 -0.101666 -0.610130 0.343978 0.033387 -0.180148 -0.390299 -0.619664 -0.330713 -0.322298 -0.216284 0.106102 -0.671328 0.257796 0.253228 0.250524 0.214150 0.211939 0.303572 0.244618 0.245646 0.211325 0.220450 0.209623 0.343871 0.313882
chargesum: 0.00000
title: Mulliken charges with hydrogens summed into heavy atoms:
elementType: S N N N C C C C C C C C C C
charge: 0.159508 -0.177496 -0.101666 0.047623 0.343978 0.033387 -0.180148 -0.132503 -0.115912 0.095375 -0.077680 0.029362 0.106102 -0.029930
polarizability: 2.43567715e+02 -1.19143668e+01 1.27623269e+02 1.11875574e+01 9.56240077e+00 9.37516769e+01
1716.lowfreq: -10.5544 -5.2574 -0.0013 -0.0006 0.0006 3.0875 11.7287 38.1665 46.0567
frequency: 8.1004 38.1528 46.0370 93.4619 109.1390 120.0318 187.6871 190.5149 218.2145 219.9019 272.9592 310.2907 325.8886 370.7585 394.3784 429.4349 441.8466 488.2807 529.0275 551.0652 609.0807 680.5402 686.1207 687.6549 695.2387 747.6189 757.4766 827.8128 833.8054 854.4032 870.7871 897.1949 900.3419 950.6576 962.9590 1032.6517 1038.8987 1047.8702 1053.0024 1104.8647 1118.9552 1206.3461 1211.5492 1223.6570 1241.8551 1269.2409 1282.7779 1289.7026 1333.1051 1367.9542 1384.7969 1402.9851 1448.9716 1454.7237 1458.3707 1475.0789 1476.0211 1486.2329 1567.2943 1582.8892 1620.8771 1651.3349 2975.3043 2986.5666 3012.6601 3033.5234 3071.7018 3076.1599 3091.7092 3143.5377 3151.9099 3169.5954 3578.1098 3600.5362 3725.4966
redmass: 4.4294 1.6686 3.9527 2.6746 4.8124 1.2079 4.7179 4.8755 1.3558 2.5109 4.6358 3.8458 3.8493 6.0819 6.9490 2.0883 1.4121 3.5198 1.1939 6.2252 4.1767 8.0277 6.2955 8.2013 5.1716 1.0799 4.0398 1.5030 4.8787 1.1834 1.4465 2.7633 2.7549 1.3388 3.2912 2.2264 1.1851 2.6366 2.0123 2.1569 1.5140 3.2182 1.4382 1.3354 1.2254 4.6664 1.1056 1.4266 1.4487 4.4563 1.2041 4.7752 2.9163 1.0963 5.9909 1.0479 1.0462 1.0813 3.1499 2.8856 2.8036 3.6616 1.0350 1.0599 1.0563 1.1014 1.1022 1.0994 1.1083 1.0884 1.0930 1.0967 1.0454 1.0808 1.1050
irintensity: 2.6555 0.1914 0.1857 0.9327 6.1681 82.5183 10.5445 9.8998 0.6406 2.1213 4.1820 3.5020 2.0434 8.0508 11.5680 20.2596 218.7834 2.1276 117.5845 6.8152 18.2375 2.7311 9.0298 0.8858 3.6802 8.8161 0.0679 46.9407 0.6639 0.8402 25.2368 14.4512 0.9820 0.4730 0.9545 1.6239 0.9792 4.9053 1.7786 27.8702 6.6090 5.8300 0.3987 2.1703 8.3466 90.4714 0.1363 6.4386 5.1933 5.9678 12.2111 76.8186 93.0287 10.1328 9.7429 6.7490 10.0259 12.2432 204.8204 1.7828 114.2173 512.9104 40.7398 20.7222 28.8333 2.7888 25.8435 53.8240 56.8292 4.4568 4.2158 9.2171 144.4051 34.1051 45.0347
temp: 298.150 k
press: 1.00000 atm
elementType: 16 7 7 7 6 6 6 6 6 6 6 6 6 6 1 1 1 1 1 1 1 1 1 1 1 1 1
symmnumber: 1
zpe: 566764.8 jmol-1
zpe.correction: 0.215869 hartree
zpe.thermalcorrener: 0.230418 hartree
zpe.thermalcorrenthalpy: 0.231362 hartree
zpe.thermalcorrgfe: 0.171658 hartree
zpe.sumelectzpe: -950.162687 hartree
zpe.sumelectthermal: -950.148138 hartree
zpe.sumelectthermalent: -950.147194 hartree
zpe.sumelectthermalfe: -950.206898 hartree
dipole: 2.6640 -4.4119 0.9868
dipole: 5.2474
quadrupole: -64.4207 -81.3163 -97.0000
quadrupole: -17.3882 -5.2499 2.3879
quadrupole: 16.4916 -0.4040 -16.0877 -17.3882 -5.2499 2.3879
hfenergy: -950.3785562 hartree
pointgroup: C01 [X(C10H13N3S1)]
dipole: 1.0315253 1.4148454 -1.0937703 debye
polarizability: 243.0038029|5.8408455|128.9721469|-17.8263964|-6.6388907|92.9667112 unknown
InChI: InChI=1S/C10H13N3S/c1-2-5-14-7-3-4-8-9(6-7)13-10(11)12-8/h3-4,6,13H,2,5,11H2,1H3
charge 0 multiplicity 1
27 atoms
S  -2.556257 0.485794 1.293456
N  2.546154 1.246023 -0.284545
N  3.1391 -0.969528 -0.204624
N  4.832308 0.615959 -0.860288
C  1.383987 0.553803 0.121067
C  1.780717 -0.827994 0.163161
C  -0.843602 -0.015069 0.81795
C  0.084944 0.985167 0.438318
C  -3.477998 0.067265 -0.327963
C  -4.980971 0.337385 -0.148824
C  0.838761 -1.807881 0.546474
C  -0.468971 -1.386917 0.877096
C  3.554961 0.284475 -0.461373
C  -5.777211 0.003945 -1.43181
H  -0.219846 2.035667 0.404406
H  -3.282061 -0.995177 -0.554336
H  -3.04497 0.691722 -1.128556
H  -5.363885 -0.266175 0.696881
H  -5.135605 1.400211 0.121534
H  2.627671 2.251906 -0.41526
H  1.125456 -2.862554 0.593129
H  -1.214342 -2.121622 1.199129
H  -5.663814 -1.061603 -1.705534
H  -6.854793 0.204417 -1.289694
H  -5.429215 0.61201 -2.287727
H  5.499006 -0.143805 -0.961181
H  5.125177 1.570174 -1.039986
