program: Gaussian 09
title: 000134029
version: EM64L-G09RevD.01
frameworkgroup: C1[X(C11H15N3O2S)]
method: RPBEPBE
basis: SDD
operation: Freq
keyword: #p
keyword: freq=noraman
keyword: PBEPBE/SDD
title: #p freq=noraman PBEPBE/SDD
converged: YES YES NO NO
title: Mulliken charges:
elementType: S O O N N N C C C C C C C C C C C H H H H H H H H H H H H H H H
charge: 0.877529 -0.571945 -0.558615 -0.243272 -0.086746 -0.623760 -0.045098 -0.545540 0.388889 -0.420940 0.022354 -0.317958 -0.265658 -0.307622 0.124528 -0.671027 -0.662856 0.255080 0.257602 0.295388 0.239104 0.241736 0.277433 0.255924 0.230696 0.213764 0.211784 0.242309 0.244906 0.261071 0.346838 0.334102
chargesum: 0.00000
title: Mulliken charges with hydrogens summed into heavy atoms:
elementType: S O O N N N C C C C C C C C C C C
charge: 0.877529 -0.571945 -0.558615 -0.243272 -0.086746 0.057180 -0.045098 -0.032857 0.388889 -0.125552 0.022354 0.162882 0.011775 -0.051698 0.124528 -0.014783 0.085429
polarizability: 2.72380084e+02 1.11667994e+01 1.64104582e+02 -9.01566969e+00 5.51776708e+00 1.10264600e+02
1716.lowfreq: -13.6889 -8.3468 0.0007 0.0014 0.0020 4.0514 10.3104 20.5856 41.1300
frequency: -4.0602 18.6207 41.1274 46.0235 65.9390 97.4063 109.0600 122.6976 173.0825 192.8642 216.4909 225.1977 232.2718 240.2857 249.2755 256.5211 278.8643 300.3503 348.2740 361.2191 390.2953 435.1428 470.4197 472.2789 529.5328 552.9941 581.0219 602.5799 619.3348 676.8837 691.4313 738.6074 757.4020 763.8823 788.3396 828.5581 838.7003 853.1265 885.0559 900.7789 904.6224 915.6654 954.1352 1032.5089 1035.8657 1042.5051 1054.9884 1087.2594 1105.8433 1121.3455 1125.8506 1186.6119 1211.5198 1225.0257 1241.9419 1268.6790 1292.3431 1308.0226 1336.2483 1381.7147 1385.5190 1406.4819 1407.8577 1440.5046 1456.4900 1473.0371 1475.5734 1477.1452 1478.0653 1488.2607 1489.4154 1557.0271 1588.6645 1616.5186 1647.1494 2974.8978 2979.5385 3003.9563 3036.0492 3051.6881 3054.5562 3081.6608 3083.3916 3113.9291 3128.3657 3141.4746 3150.4866 3176.1313 3575.0059 3720.8500
redmass: 1.0745 3.4336 3.5632 2.8745 2.2372 4.7908 5.2369 3.0045 5.3924 6.3884 2.6588 1.3197 2.3686 2.5567 3.3009 3.7185 2.9746 4.0886 5.5074 5.2023 6.1428 2.8317 6.6919 1.2988 5.8811 3.6457 4.3826 5.2715 5.0024 7.0163 9.9770 5.9696 1.1040 3.7104 14.6599 1.5409 1.4357 4.8226 1.4571 1.8388 3.2314 3.7375 1.3529 2.0167 1.9443 2.8414 1.3151 3.4800 2.2107 1.3075 1.3222 2.1105 1.4235 1.2290 2.1714 2.1742 1.1066 4.4727 1.3748 3.2889 1.1889 1.1536 2.2990 3.4314 2.1136 1.9150 1.0423 1.0420 1.0402 1.0910 1.5289 2.6521 3.4944 3.6252 2.9671 1.0367 1.0352 1.0597 1.0554 1.1025 1.1016 1.1022 1.0995 1.0968 1.1103 1.0925 1.0889 1.0963 1.0452 1.1048
irintensity: 3.3858 3.2335 1.1239 1.3542 1.4772 0.3982 2.2979 0.9235 22.3824 0.4876 25.9527 10.3881 19.7229 60.7919 1.6783 0.3904 4.2737 26.5666 3.5132 1.7698 41.1665 4.2088 143.1852 138.2581 14.1284 3.9072 0.9232 8.0127 32.4567 18.6883 7.8703 2.8483 5.1200 3.3539 80.7564 35.2221 14.6598 5.8170 20.3442 6.8023 14.8118 41.1025 0.6967 8.4475 37.8012 25.6699 11.8874 4.8940 43.8081 0.4112 37.6380 10.1337 0.0169 3.7629 12.8499 83.7784 0.9730 29.9062 8.0585 21.3337 8.2769 8.4024 43.6329 15.9119 29.6803 116.4817 13.2376 4.5955 14.8554 16.1126 17.7697 222.6141 14.6176 108.7870 491.6455 59.3757 39.7190 7.5073 11.9051 24.2436 1.8383 35.9465 39.8371 5.4946 8.0601 8.3590 0.7785 6.2402 162.4814 47.0443
temp: 298.150 k
press: 1.00000 atm
elementType: 16 8 8 7 7 7 6 6 6 6 6 6 6 6 6 6 6 1 1 1 1 1 1 1 1 1 1 1 1 1 1 1
symmnumber: 1
zpe: 654622.4 jmol-1
zpe.correction: 0.249333 hartree
zpe.thermalcorrener: 0.266941 hartree
zpe.thermalcorrenthalpy: 0.267885 hartree
zpe.thermalcorrgfe: 0.202499 hartree
zpe.sumelectzpe: -1139.519582 hartree
zpe.sumelectthermal: -1139.501973 hartree
zpe.sumelectthermalent: -1139.501029 hartree
zpe.sumelectthermalfe: -1139.566415 hartree
dipole: -5.8129 -4.1410 4.8658
dipole: 8.6379
quadrupole: -78.4836 -105.5341 -119.4322
quadrupole: 16.3987 14.9585 -0.0727
quadrupole: 22.6664 -4.3842 -18.2822 16.3987 14.9585 -0.0727
hfenergy: -1139.7689142 hartree
pointgroup: C01 [X(C11H15N3O2S1)]
dipole: 2.2879774 1.9215751 1.6192433 debye
polarizability: 272.2631133|13.4359536|161.5706994|5.2346375|-13.309979|112.9154542 unknown
InChI: InChI=1S/C11H15N3O2S/c1-3-6-17(15,16)8-4-5-9-10(7-8)14(2)11(12)13-9/h4-5,7H,3,6,12H2,1-2H3
charge 0 multiplicity 1
32 atoms
S  -2.414139 -0.091272 -0.78844
O  -2.397653 1.277903 -1.698368
O  -3.104708 -1.4780 -1.326473
N  2.807994 1.033722 -0.172611
N  3.377753 -1.043389 0.656943
N  5.129175 0.593724 0.404699
C  -0.63191 -0.447516 -0.291087
C  -3.326584 0.361847 0.868537
C  1.612785 0.284054 -0.128397
C  0.291952 0.597034 -0.481371
C  1.996144 -1.007147 0.389945
C  -4.794504 0.656985 0.557652
C  -0.310677 -1.73819 0.184387
C  1.026151 -2.024735 0.538868
C  3.819829 0.183705 0.308682
C  -5.573058 1.000409 1.850039
C  2.975399 2.409182 -0.641543
H  -2.765056 1.23022 1.250919
H  -3.175999 -0.525742 1.505403
H  -0.038367 1.550148 -0.908997
H  -4.854604 1.498947 -0.156972
H  -5.245782 -0.224924 0.065741
H  -1.088375 -2.50696 0.239043
H  1.316941 -3.011768 0.908605
H  -6.630703 1.212559 1.612323
H  -5.549682 0.16158 2.570075
H  -5.152874 1.892535 2.350274
H  3.345648 3.068599 0.166141
H  3.670251 2.458166 -1.501098
H  2.002208 2.798781 -0.976703
H  5.804548 -0.079843 0.754904
H  5.438697 1.518185 0.123482
