program: Gaussian 09
title: 000134061
version: EM64L-G09RevD.01
frameworkgroup: C1[X(C29H21NO9)]
method: RPBEPBE
basis: SDD
operation: Freq
keyword: #p
keyword: freq=noraman
keyword: PBEPBE/SDD
title: #p freq=noraman PBEPBE/SDD
converged: YES YES NO NO
title: Mulliken charges:
elementType: O O O O O O O O O N C C C C C C C C C C C C C C C C C C C C C C C C C C C C C H H H H H H H H H H H H H H H H H H H H H
charge: -0.279050 -0.364962 -0.384304 -0.210058 -0.112563 -0.160047 -0.186805 -0.293433 -0.288221 -0.230288 0.340510 -0.612564 -0.394471 0.516709 -0.310191 -0.131560 0.162132 -0.695327 -0.760731 0.051658 0.116995 0.467915 0.156017 0.285247 -0.489851 -0.419489 -0.106702 0.123335 -0.157430 0.064061 0.072131 0.212410 0.230897 -0.519128 -0.513486 0.207599 0.246995 -0.528299 -0.529475 0.241232 0.257210 0.245501 0.276427 0.213359 0.233937 0.231250 0.236466 0.238348 0.254384 0.255881 0.291220 0.400007 0.305712 0.296244 0.231351 0.237083 0.249282 0.262258 0.230601 0.236068
chargesum: 0.00000
title: Mulliken charges with hydrogens summed into heavy atoms:
elementType: O O O O O O O O O N C C C C C C C C C C C C C C C C C C C C C C C C C C C C C
charge: -0.279050 -0.364962 0.015703 -0.210058 -0.112563 -0.160047 -0.186805 -0.293433 -0.288221 -0.230288 0.340510 -0.114121 0.127456 0.516709 0.137106 -0.131560 0.162132 0.010737 -0.506347 0.051658 0.116995 0.467915 0.156017 0.285247 -0.233969 -0.128269 -0.106702 0.123335 -0.157430 0.064061 0.072131 0.212410 0.230897 -0.213415 -0.217243 0.207599 0.246995 0.189417 0.199452
polarizability: 6.97983914e+02 1.76341753e+01 3.91754104e+02 -8.47412155e+00 -1.04326429e+01 1.81164070e+02
1716.lowfreq: -1.5731 -0.0016 -0.0010 0.0008 4.9107 6.0327 16.5003 30.6618 34.8568
frequency: 16.4202 30.4319 34.8133 42.4577 52.2127 60.3787 74.0622 82.6349 96.9944 100.7902 106.2407 113.8389 128.0623 143.2093 154.1558 157.6671 160.7562 165.0044 174.6524 187.2986 206.7136 212.6061 217.1377 230.0636 242.0736 246.5405 258.7724 266.3193 282.7103 285.0864 301.0472 324.6919 327.8412 332.5168 342.8385 364.6828 373.8411 378.2831 394.5634 409.7854 413.1614 424.1143 458.6610 481.5767 486.7324 491.2087 507.1118 516.2339 530.3395 532.0040 561.0166 563.1108 583.2104 586.9654 603.8070 610.0753 621.2153 627.7165 638.2902 651.4339 662.8458 678.4512 693.3099 710.7102 717.9943 733.6629 741.8535 742.4396 756.0517 778.2186 798.9143 820.3115 830.2337 836.1438 856.1617 858.2501 866.6211 883.4720 889.3250 906.5688 914.8431 928.6882 933.5777 938.7688 952.8515 956.4974 967.9639 993.4343 1001.5634 1002.0036 1015.2857 1028.2901 1070.0538 1074.6668 1093.7448 1101.2297 1108.4669 1112.5780 1116.3937 1121.0788 1131.5125 1141.5186 1153.9433 1158.1617 1163.4631 1177.8107 1184.9933 1204.3091 1205.7879 1211.0348 1217.8775 1229.6052 1266.0288 1268.0452 1272.6767 1283.5358 1303.1446 1325.5058 1326.1661 1333.4601 1345.7846 1364.5083 1375.8891 1387.1706 1399.7820 1402.1525 1404.1270 1420.2976 1422.9219 1425.4868 1444.2445 1448.2146 1457.1334 1458.5173 1459.8574 1461.1250 1471.3115 1472.7596 1475.4540 1479.5832 1484.5698 1486.1253 1497.1966 1531.3524 1540.6935 1543.2535 1556.9046 1578.9461 1591.4032 1597.4840 1609.0488 1622.4985 1627.6045 2646.4541 2976.5980 2983.8778 2987.8494 2994.5323 2998.2711 3006.5529 3072.5072 3073.3785 3084.6156 3095.1756 3100.5043 3104.2917 3107.9013 3128.2357 3133.4501 3134.2160 3137.5824 3166.0403 3167.5440 3184.4164
redmass: 6.6376 5.0734 6.1445 7.0617 5.3385 4.1084 4.6499 5.3098 5.0367 3.8016 3.2359 5.1828 6.9926 2.8047 1.7114 3.0818 2.3295 1.5651 5.3749 5.9611 4.2382 1.1821 2.9467 5.9349 5.6335 4.7710 7.9688 6.7460 5.2362 6.5850 5.1198 5.8183 7.0885 4.2325 3.0933 5.5690 6.8783 5.3455 7.7834 5.8061 6.2980 7.1949 9.8264 4.2383 5.2123 4.3534 7.4587 9.7287 6.2311 7.4251 7.2056 5.9285 5.6338 5.8545 5.0985 4.3223 4.2731 5.8185 6.4187 7.4286 5.0107 5.4852 6.1763 6.3043 6.5172 7.8529 4.4671 5.9160 5.5390 4.4628 6.4227 2.2727 2.3666 7.1479 4.0550 3.9464 2.1808 1.5913 2.0570 2.3738 5.7841 2.4242 3.4633 1.6052 4.2068 2.0066 1.1124 5.4611 1.3788 4.0763 4.3944 4.6053 3.4613 2.5710 1.9668 2.2693 2.1095 1.3717 1.4936 2.3121 1.7727 2.2402 1.5594 1.7238 1.5090 2.9253 1.7097 1.9751 2.1427 1.3709 1.7920 2.8172 6.8584 2.0126 2.7430 2.4717 2.6507 1.6660 2.0802 1.8583 3.8715 5.2515 6.2486 1.2425 3.3296 7.0748 4.6654 4.7859 3.7795 1.2581 1.1289 1.5523 1.4667 1.1131 1.1138 1.4201 1.2952 2.4688 1.0633 1.1718 1.0913 1.0536 4.6186 9.8270 11.5562 8.1339 11.0037 10.6272 10.6664 4.8184 7.5415 7.7009 4.0436 1.0737 1.0304 1.0307 1.0649 1.0674 1.0357 1.0638 1.0965 1.1052 1.1042 1.0983 1.1001 1.1027 1.1007 1.1025 1.1037 1.0915 1.0892 1.0965 1.0920 1.0932
irintensity: 2.7239 0.3518 0.3550 0.8208 0.2257 1.5662 4.6631 0.2623 5.9027 3.1850 10.4199 3.3132 0.1647 2.1668 2.3382 0.7489 1.0942 0.9934 1.3874 1.3541 3.7599 0.9383 0.6750 3.5343 5.8650 8.4444 9.3099 0.9508 2.5569 4.6186 1.5150 2.9931 0.1329 9.2484 2.6336 1.2415 13.0994 45.9417 5.5019 18.4298 7.7283 6.4538 3.6391 10.2035 4.6219 1.9181 9.6970 2.4881 4.8247 48.5963 12.5947 3.8505 18.5167 6.9229 9.1378 4.6287 2.7821 4.7119 3.1812 8.1864 2.7666 4.7220 10.6629 4.9665 14.4621 6.4769 23.4057 6.0868 3.3587 20.3323 4.9975 11.0726 17.6568 6.9047 1.6773 18.1547 18.4296 18.0517 30.0650 28.7135 33.2682 12.4486 1.8903 38.6519 166.7499 4.4402 103.7828 18.1505 1.2340 61.1831 93.2625 38.8004 2.8633 42.6408 89.5963 23.9026 134.6048 35.1405 6.9438 17.2788 101.4983 43.1962 3.5411 43.3874 13.5276 24.9555 28.5070 32.2718 24.4218 7.1304 48.1696 6.0632 463.4928 35.8064 224.9444 100.0112 49.4602 28.4529 256.0704 198.6952 16.3861 89.7671 95.0544 33.5585 168.6141 217.4744 45.7587 46.1098 98.7468 6.7902 28.5158 62.1091 99.3413 26.1685 46.4337 86.6554 52.6154 160.3367 11.0170 7.4712 1.3134 24.4718 295.3283 8.7058 42.4395 203.8511 72.5329 152.9947 344.7411 172.1803 33.0444 30.5326 165.8049 665.0028 73.1747 91.6326 9.3886 76.6921 4.9645 36.8763 10.7118 25.0493 20.6821 26.4290 24.1412 19.7693 19.8415 24.6204 20.3921 4.7503 12.5180 9.3243 6.3537 0.8484
temp: 298.150 k
press: 1.00000 atm
elementType: 8 8 8 8 8 8 8 8 8 7 6 6 6 6 6 6 6 6 6 6 6 6 6 6 6 6 6 6 6 6 6 6 6 6 6 6 6 6 6 1 1 1 1 1 1 1 1 1 1 1 1 1 1 1 1 1 1 1 1 1
symmnumber: 1
zpe: 1153485.3 jmol-1
zpe.correction: 0.439339 hartree
zpe.thermalcorrener: 0.472176 hartree
zpe.thermalcorrenthalpy: 0.473120 hartree
zpe.thermalcorrgfe: 0.375274 hartree
zpe.sumelectzpe: -1846.717011 hartree
zpe.sumelectthermal: -1846.684174 hartree
zpe.sumelectthermalent: -1846.683230 hartree
zpe.sumelectthermalfe: -1846.781076 hartree
dipole: -2.3533 0.8443 -2.0926
dipole: 3.2603
quadrupole: -131.9415 -225.2366 -223.7530
quadrupole: -8.2991 2.2530 9.5146
quadrupole: 61.7022 -31.5929 -30.1093 -8.2991 2.2530 9.5146
hfenergy: -1847.1563502 hartree
pointgroup: C01 [X(C29H21N1O9)]
dipole: -0.9267395 -0.3108723 0.8305884 debye
polarizability: 698.052855|-16.3005056|390.8424456|10.2486496|-16.6269801|182.0067867 unknown
InChI: InChI=1S/C29H21NO9/c1-29-11-13-8-12-4-5-14-21(19(12)25(33)20(13)28(35)30(29)6-7-38-29)26(34)22-23(31)15-9-17(36-2)18(37-3)10-16(15)39-27(22)24(14)32/h4-5,8-10,33H,6-7,11H2,1-3H3
charge 0 multiplicity 1
60 atoms
O  -8.19767 0.858705 0.064882
O  -3.952931 2.667827 0.44278
O  -1.835366 1.292901 0.335014
O  3.6984 -1.656549 0.259336
O  -0.091187 0.525505 -1.625909
O  2.096548 -3.836709 0.33854
O  2.204366 2.13597 -0.73755
O  7.310049 2.630374 -0.197461
O  8.216469 -0.069224 0.473279
N  -6.000118 1.648187 0.011254
C  -6.830528 0.463629 -0.363674
C  -6.329581 -0.766779 0.420375
C  -6.847102 2.835659 0.218395
C  -4.822263 -0.932993 0.278875
C  -8.124221 2.165932 0.771562
C  -4.019399 0.254787 0.194954
C  -4.648423 1.592565 0.22555
C  -6.868427 0.237056 -1.883181
C  -4.200988 -2.17794 0.339807
C  -2.598522 0.177267 0.182377
C  -1.947806 -1.114796 0.092776
C  -2.77424 -2.294082 0.260372
C  -0.530407 -1.271072 -0.07207
C  0.060933 -2.539999 0.143351
C  -2.139549 -3.577776 0.371563
C  -0.755257 -3.694192 0.366559
C  0.347788 -0.217749 -0.707083
C  1.802772 -0.238012 -0.353531
C  1.539629 -2.713079 0.156902
C  2.352323 -1.455904 0.012392
C  2.653336 0.979336 -0.47854
C  4.101391 0.727712 -0.23633
C  4.575991 -0.56119 0.121934
C  5.048037 1.778036 -0.331982
C  5.939007 -0.827284 0.348349
C  6.409124 1.550297 -0.088969
C  6.866587 0.222006 0.223042
C  7.957475 3.023961 1.079241
C  9.160315 0.226751 -0.636097
H  -6.862987 -1.668286 0.074593
H  -6.590642 -0.617926 1.486979
H  -7.037119 3.365066 -0.733797
H  -6.352838 3.527084 0.918607
H  -8.0461 2.002127 1.863684
H  -9.051959 2.710725 0.536819
H  -7.126384 1.173419 -2.40492
H  -5.892299 -0.123037 -2.252325
H  -7.639057 -0.51602 -2.120664
H  -4.799189 -3.087831 0.461177
H  -2.7701 -4.465611 0.492367
H  -0.253968 -4.657049 0.504638
H  -2.483113 2.109296 0.420974
H  4.694728 2.782665 -0.583493
H  6.279261 -1.835122 0.597174
H  7.192587 3.379306 1.794276
H  8.638682 3.847069 0.817603
H  8.51943 2.178851 1.516785
H  9.079103 1.279436 -0.95702
H  8.952154 -0.446538 -1.487871
H  10.158854 0.017044 -0.225672
