program: Gaussian 09
title: 000133945
version: EM64L-G09RevD.01
frameworkgroup: C1[X(C16H18N2O)]
method: RPBEPBE
basis: SDD
operation: Freq
keyword: #p
keyword: freq=noraman
keyword: PBEPBE/SDD
title: #p freq=noraman PBEPBE/SDD
converged: YES YES NO NO
title: Mulliken charges:
elementType: O N N C C C C C C C C C C C C C C C C H H H H H H H H H H H H H H H H H H
charge: -0.306356 -0.088988 -0.406722 -0.218194 0.387493 -0.261055 -0.197218 -0.454663 0.503692 -0.591972 -0.789354 -0.202533 0.402809 -0.640004 -0.484021 0.231316 -0.450328 -0.206192 -0.370506 0.228184 0.233400 0.235619 0.200638 0.215487 0.209017 0.262615 0.225899 0.238669 0.220147 0.194333 0.225810 0.220944 0.229621 0.262856 0.300677 0.213273 0.225606
chargesum: 0.00000
title: Mulliken charges with hydrogens summed into heavy atoms:
elementType: O N N C C C C C C C C C C C C C C C C
charge: -0.306356 -0.088988 -0.106045 0.009990 0.387493 -0.027655 0.038401 -0.038538 0.503692 -0.120340 -0.104639 -0.202533 0.402809 0.001083 -0.254399 0.231316 -0.187472 0.007081 -0.144900
polarizability: 2.27812490e+02 -6.86820693e+00 1.89139258e+02 -5.23403111e+00 -2.39284273e+01 1.26557176e+02
1716.lowfreq: -11.0885 -7.6944 -0.0005 -0.0002 0.0006 5.6495 56.0988 74.6794 108.6173
frequency: 56.0663 74.6609 108.6140 138.5737 160.6505 202.3920 208.5502 216.0363 229.2812 237.6097 257.7814 285.2561 321.2140 346.6908 364.8258 392.7655 414.4401 441.2793 452.5200 475.7309 491.1300 513.4467 530.7610 560.0366 585.5081 603.8223 621.1571 643.6504 701.4616 733.5354 741.6718 755.2091 769.7993 784.8181 805.9164 809.2375 833.2956 878.2425 882.5382 889.5681 944.6679 949.6701 952.5753 990.4559 1022.1983 1029.0057 1040.5633 1049.0705 1067.8620 1074.1908 1093.1263 1103.8028 1113.9702 1131.4045 1150.6138 1168.9963 1176.9958 1193.5776 1212.6392 1228.3846 1236.8426 1254.9250 1262.2676 1280.3211 1291.4165 1296.3620 1318.9943 1329.2703 1344.2656 1351.2677 1376.6228 1389.6672 1406.0793 1417.3254 1424.0925 1434.8071 1450.4337 1457.4644 1461.1995 1467.0998 1468.2724 1475.2954 1491.7821 1500.3342 1565.6660 1617.9167 1630.5069 2848.9817 2870.5717 2970.9730 2977.7613 2988.3509 2989.1311 2993.9182 3006.3170 3045.2747 3065.7275 3069.1840 3069.6464 3093.6755 3115.3781 3131.7477 3153.9672 3217.7135 3613.9111
redmass: 4.6694 4.3645 2.6656 3.2125 2.9779 2.2273 1.6149 1.5984 1.5901 3.2779 4.1293 2.8924 3.1853 2.9686 5.3391 3.4906 3.4550 3.4593 4.2192 4.1567 1.2689 4.3624 3.0455 5.3930 4.7062 3.4108 3.8842 5.7446 4.6011 4.9526 2.1429 1.7310 2.8779 1.7570 3.5768 3.7270 4.2118 2.7640 1.8209 3.0048 1.8017 1.4053 1.7097 1.9515 2.2217 2.7814 2.1367 1.8532 1.7116 1.6288 2.4980 2.3056 1.5365 3.0795 2.0274 1.1807 1.2736 1.7230 1.5667 1.6742 1.5705 1.4663 1.7065 1.9042 1.8683 2.0192 1.5884 1.3549 1.9423 1.5788 1.7385 1.2447 2.8499 3.2450 2.1355 1.2399 1.6215 1.5173 1.3164 1.1064 1.1376 1.1084 1.0670 3.3593 6.8400 7.1562 8.3089 1.0706 1.0557 1.0818 1.0373 1.0799 1.0634 1.0857 1.0749 1.1013 1.0983 1.0997 1.0902 1.0990 1.0867 1.0905 1.0983 1.0981 1.0808
irintensity: 1.9962 0.4577 3.9688 1.5428 1.3573 6.1843 4.7175 0.4942 0.6285 3.8726 0.3522 0.1945 0.1629 5.3550 5.4255 3.7485 5.2890 3.7817 1.3039 4.0763 98.1599 8.3455 9.7322 1.9606 4.8895 1.1148 1.8342 6.7636 19.8470 1.0746 25.6286 53.5213 20.1848 26.2930 2.0197 12.2596 1.1666 5.2969 2.7246 1.9537 0.4776 1.3206 3.6731 1.3072 1.5615 24.1039 10.9382 52.5989 13.6228 8.0528 5.9668 17.6987 1.9926 18.8281 18.4645 2.5639 6.8990 6.1453 2.2061 2.7446 19.6506 16.9233 3.1186 1.1327 9.0756 12.1925 13.5462 0.6654 26.3872 10.1421 1.5367 17.4994 6.6912 9.8223 2.0189 9.0893 2.1352 35.2850 17.2941 4.3300 10.8542 6.5893 9.7373 0.8549 1.1936 11.2260 7.9393 60.7849 129.4314 12.7544 23.3010 30.2292 57.6953 43.7315 52.8066 15.5615 18.0415 32.8739 30.8679 21.5587 7.7029 18.4028 38.2730 2.0352 58.4154
temp: 298.150 k
press: 1.00000 atm
elementType: 8 7 7 6 6 6 6 6 6 6 6 6 6 6 6 6 6 6 6 1 1 1 1 1 1 1 1 1 1 1 1 1 1 1 1 1 1
symmnumber: 1
zpe: 804107.3 jmol-1
zpe.correction: 0.306268 hartree
zpe.thermalcorrener: 0.321961 hartree
zpe.thermalcorrenthalpy: 0.322906 hartree
zpe.thermalcorrgfe: 0.264751 hartree
zpe.sumelectzpe: -803.812619 hartree
zpe.sumelectthermal: -803.796926 hartree
zpe.sumelectthermalent: -803.795982 hartree
zpe.sumelectthermalfe: -803.854136 hartree
dipole: -0.0877 1.5287 0.6587
dipole: 1.6669
quadrupole: -90.1068 -101.7540 -118.0615
quadrupole: 4.9687 -5.1482 -5.5949
quadrupole: 13.2006 1.5535 -14.7541 4.9687 -5.1482 -5.5949
hfenergy: -804.1188876 hartree
pointgroup: C01 [X(C16H18N2O1)]
dipole: -0.0399355 0.5952203 0.2723637 debye
polarizability: 227.9702243|-6.3477928|190.1397077|-4.1892986|-22.5727052|125.398992 unknown
InChI: InChI=1S/C16H18N2O/c1-16-8-18(2)12-6-9-7-17-11-5-3-4-10(13(9)11)14(12)15(16)19-16/h3-5,7,12,14-15,17H,6,8H2,1-2H3
charge 0 multiplicity 1
37 atoms
O  -1.544383 -0.887218 -1.614261
N  -2.490936 0.947869 0.927886
N  3.33841 1.428858 -0.81841
C  -1.409754 -1.444674 -0.21131
C  -2.753609 -0.973895 -0.678021
C  -0.598496 -0.636263 0.797466
C  -1.012532 0.877956 0.803401
C  -3.263689 0.387073 -0.202901
C  0.904787 -0.822894 0.613807
C  -0.408242 1.737094 -0.374082
C  -3.808859 -1.964938 -1.129711
C  1.603999 0.238061 0.001433
C  1.076876 1.491232 -0.468075
C  -3.012132 2.25707 1.355256
C  1.658802 -1.948391 1.000648
C  3.013994 0.203797 -0.220466
C  2.163642 2.207828 -0.963452
C  3.069182 -1.99359 0.767314
C  3.772731 -0.928019 0.158823
H  -1.214683 -2.527608 -0.206258
H  -0.900018 -1.033767 1.789454
H  -0.602968 1.296987 1.744988
H  -3.289516 1.068379 -1.091975
H  -4.312614 0.275368 0.136391
H  -0.634705 2.805988 -0.197932
H  -0.896854 1.433749 -1.318539
H  -4.472113 -1.514078 -1.891577
H  -3.33571 -2.856727 -1.57463
H  -4.435882 -2.285664 -0.276514
H  -2.962417 3.04867 0.56701
H  -2.444009 2.61351 2.233052
H  -4.072189 2.153386 1.654771
H  1.173185 -2.799746 1.493651
H  2.210712 3.197838 -1.414118
H  4.270042 1.723967 -1.100529
H  3.627176 -2.884522 1.078042
H  4.854974 -0.991186 0.000568
