program: Gaussian 09
title: 000133957
version: EM64L-G09RevD.01
frameworkgroup: C1[X(C11H19N5O2S2)]
method: RPBEPBE
basis: SDD
operation: Freq
keyword: #p
keyword: freq=noraman
keyword: PBEPBE/SDD
title: #p freq=noraman PBEPBE/SDD
converged: YES YES NO NO
title: Mulliken charges:
elementType: S S O O N N N N N C C C C C C C C C C C H H H H H H H H H H H H H H H H H H H
charge: 0.156750 0.245876 -0.332635 -0.268044 -0.377789 -0.002846 -0.302415 -0.392425 0.101143 -0.316802 -0.727347 -0.787756 0.469303 -0.153462 -0.409579 -0.701104 0.441118 -0.300606 -0.612618 -0.654838 0.251243 0.239253 0.283923 0.268108 0.266974 0.281282 0.328264 0.202345 0.254135 0.282921 0.268152 0.360012 0.271166 0.230774 0.229238 0.194240 0.238233 0.246948 0.228866
chargesum: 0.00000
title: Mulliken charges with hydrogens summed into heavy atoms:
elementType: S S O O N N N N N C C C C C C C C C C C
charge: 0.156750 0.245876 -0.332635 -0.268044 -0.049525 -0.002846 -0.034264 -0.032413 0.101143 0.173694 -0.175316 -0.239500 0.469303 -0.153462 0.046901 -0.418184 0.441118 -0.029440 0.041634 0.059208
polarizability: 3.02475900e+02 3.22437997e+00 1.86020365e+02 2.46774514e+01 1.22274733e+01 1.57470551e+02
1716.lowfreq: -9.0094 -2.9720 -0.0020 -0.0015 -0.0012 5.3493 7.7102 13.5243 20.8527
frequency: 5.9673 13.2858 20.6052 21.6652 45.4339 62.7959 68.9001 77.3840 89.9123 99.0161 109.4396 138.4584 153.4365 155.4731 199.6730 220.5543 221.1741 223.7444 257.4396 264.2929 284.2813 287.3896 299.7491 318.9105 375.9003 394.8267 416.1625 507.0537 529.1320 535.5113 563.4269 590.5263 598.0223 608.7773 613.2295 630.6037 640.7064 657.6814 672.5392 704.3560 718.4199 723.7762 792.5745 809.1510 815.2954 843.9586 871.0331 880.1723 927.2821 943.4999 976.6766 991.0386 992.8178 1030.7779 1070.4380 1084.9662 1110.7690 1113.6167 1117.1397 1137.7512 1143.3205 1164.5655 1168.4187 1177.7402 1198.6090 1219.9329 1228.0864 1236.5457 1244.4712 1267.6337 1292.2509 1314.1866 1335.4659 1344.1581 1350.5194 1402.4309 1431.0030 1435.1944 1442.5508 1447.1087 1448.5903 1461.1610 1464.9406 1470.5382 1475.0034 1489.9302 1493.3199 1497.0104 1514.3746 1543.9510 1567.9242 1633.2613 2842.1488 2876.2642 2946.7902 2948.1918 3011.0107 3014.9874 3018.5721 3031.9560 3035.9554 3036.5852 3085.0633 3106.1853 3106.5639 3114.7918 3125.7369 3238.0811 3242.5872 3445.8479 3458.5266
redmass: 6.9845 5.7790 4.8812 4.4319 3.2164 3.3042 3.5240 5.4655 5.1419 5.5025 4.4527 1.2519 4.8155 3.7109 3.3935 3.2097 4.3366 1.5236 2.1606 4.3376 2.4888 3.0372 4.4196 4.2795 3.5932 5.7463 5.3479 5.0511 3.0810 4.2471 1.4278 4.3796 4.0952 3.1890 2.2092 2.3674 2.0402 7.3942 5.0786 5.2756 3.3442 3.5454 1.5244 4.2468 2.0873 1.1495 2.1952 2.7909 2.5821 2.3505 3.8222 1.9702 1.8068 1.6653 3.1696 2.6337 1.3071 1.2822 1.1720 2.5807 1.8909 2.7048 1.6068 1.9545 1.2121 1.8257 1.2358 2.7872 1.3022 1.7729 1.2086 3.1307 1.4136 3.1693 1.4431 1.5489 1.0910 1.1478 1.1225 1.1814 1.4166 1.4093 1.0678 1.0739 1.0418 1.0851 1.0488 1.1011 6.8607 9.7253 4.2240 2.6368 1.0711 1.0559 1.0401 1.0644 1.0928 1.0996 1.0762 1.0595 1.0863 1.0598 1.0991 1.1058 1.0962 1.1088 1.0833 1.0962 1.0912 1.0763 1.0753
irintensity: 0.9994 2.4609 1.4088 1.3737 2.3289 3.4207 2.6323 0.9704 0.7951 7.3006 1.2430 0.1081 1.8459 2.1603 5.4766 2.3219 2.4155 0.9514 2.5690 1.9778 2.0677 3.9532 1.9345 6.1742 1.6434 4.5958 3.2846 14.4335 31.4459 31.7271 94.4087 41.9633 26.2757 28.4440 33.8189 2.1914 12.1260 3.5605 25.0278 0.5290 52.0462 10.8474 32.9268 5.0698 17.0734 99.1062 9.7840 19.9701 18.1169 6.3051 45.2604 21.6035 5.0107 5.2558 59.0328 16.6151 1.8011 1.8629 4.9712 19.6679 14.6185 15.6161 15.7662 14.9734 5.6418 58.1216 10.7856 63.7279 11.5993 258.6278 9.6356 2.2353 73.7780 99.8190 16.0542 108.9363 18.5594 0.9960 28.8200 49.2898 92.2332 24.2851 14.0802 7.6752 18.7260 29.3205 16.1708 21.4001 2.9416 36.6210 550.5411 460.5101 83.0772 170.2417 74.2361 39.1561 8.6723 40.1943 46.2825 20.8327 9.5207 21.3326 30.0357 16.9485 19.4406 3.7738 166.2743 2.2902 3.6139 240.6799 0.3176
temp: 298.150 k
press: 1.00000 atm
elementType: 16 16 8 8 7 7 7 7 7 6 6 6 6 6 6 6 6 6 6 6 1 1 1 1 1 1 1 1 1 1 1 1 1 1 1 1 1 1 1
symmnumber: 1
zpe: 802805.7 jmol-1
zpe.correction: 0.305773 hartree
zpe.thermalcorrener: 0.328744 hartree
zpe.thermalcorrenthalpy: 0.329688 hartree
zpe.thermalcorrgfe: 0.247221 hartree
zpe.sumelectzpe: -1649.234021 hartree
zpe.sumelectthermal: -1649.211050 hartree
zpe.sumelectthermalent: -1649.210106 hartree
zpe.sumelectthermalfe: -1649.292573 hartree
dipole: 9.6241 -0.0201 2.2401
dipole: 9.8813
quadrupole: -192.5839 -125.9670 -136.8744
quadrupole: 9.0387 -27.6889 5.7438
quadrupole: -40.7755 25.8415 14.9341 9.0387 -27.6889 5.7438
hfenergy: -1649.539794 hartree
pointgroup: C01 [X(C11H19N5O2S2)]
dipole: 3.7706374 -0.2483923 0.9133434 debye
polarizability: 301.1535987|-3.3522879|168.5792712|27.1030366|19.5895388|176.2339467 unknown
InChI: InChI=1S/C11H19N5O2S2/c1-12-5-11-15-9(8-20-11)7-19-4-3-14-10(13-2)6-16(17)18/h6,8,12-14H,3-5,7H2,1-2H3
charge 0 multiplicity 1
39 atoms
S  0.499866 -1.375498 0.518165
S  4.202182 2.161623 0.557625
O  -6.457143 0.791953 0.22242
O  -6.591878 0.235572 -2.003182
N  -2.604477 -0.971366 0.291693
N  3.537351 -0.124305 -0.653411
N  6.685597 -0.116398 0.920121
N  -4.271123 0.179304 1.504228
N  -5.930569 0.247804 -0.882069
C  -2.007331 -1.573022 -0.904324
C  -0.740017 -2.361324 -0.525153
C  1.032794 -0.066548 -0.783664
C  2.333176 0.55602 -0.381459
C  4.604076 0.530742 -0.247646
C  6.035773 0.095365 -0.391768
C  2.482238 1.777425 0.26052
C  -3.843193 -0.361923 0.322524
C  -4.64755 -0.314812 -0.847332
C  8.094068 -0.540513 0.822381
C  -3.536148 0.111289 2.764332
H  -2.72767 -2.273427 -1.370327
H  -1.766006 -0.800552 -1.666051
H  -0.990217 -3.230463 0.10671
H  -0.222449 -2.717501 -1.431155
H  0.232164 0.683589 -0.867842
H  1.149799 -0.611212 -1.734813
H  -1.934614 -0.790741 1.049505
H  6.583524 0.834249 -1.032605
H  6.023708 -0.863707 -0.941316
H  1.705428 2.471683 0.574335
H  6.549303 0.67887 1.557431
H  -5.226695 0.596591 1.41231
H  -4.309975 -0.704755 -1.802825
H  8.148594 -1.52992 0.331638
H  8.515009 -0.648468 1.836769
H  8.747138 0.158845 0.244214
H  -3.292563 -0.932832 3.046272
H  -4.165419 0.538434 3.560449
H  -2.591951 0.694028 2.7385
