program: Gaussian 09
title: 000133913
version: EM64L-G09RevD.01
frameworkgroup: C1[X(C12H21N2O3PS)]
method: RPBEPBE
basis: SDD
operation: Freq
keyword: #p
keyword: freq=noraman
keyword: PBEPBE/SDD
title: #p freq=noraman PBEPBE/SDD
converged: NO YES NO NO
title: Mulliken charges:
elementType: S P O O O N N C C C C C C C C C C C C H H H H H H H H H H H H H H H H H H H H H
charge: 0.051146 1.115931 -0.534667 -0.469149 -0.576972 0.013331 -0.033731 -0.139064 -0.078951 -0.710781 -0.708261 -0.218684 0.243347 -0.276537 -0.770600 -0.221152 -0.215995 -0.655369 -0.655948 0.255849 0.235560 0.217501 0.216231 0.234428 0.216216 0.229323 0.256338 0.248387 0.250671 0.221858 0.237217 0.216724 0.226701 0.231065 0.210155 0.226824 0.234475 0.208529 0.231938 0.236117
chargesum: 0.00000
title: Mulliken charges with hydrogens summed into heavy atoms:
elementType: S P O O O N N C C C C C C C C C C C C
charge: 0.051146 1.115931 -0.534667 -0.469149 -0.576972 0.013331 -0.033731 0.116785 -0.078951 -0.041489 -0.028294 -0.218684 0.243347 -0.020199 -0.049684 0.232789 0.241771 0.016084 0.020636
polarizability: 2.75802655e+02 8.22754212e+00 2.00823924e+02 -6.44354144e+00 -1.22973250e+01 1.59675961e+02
1716.lowfreq: -26.1909 -12.5662 -2.3435 -0.0021 -0.0016 -0.0012 6.2577 15.2266 17.1261
frequency: -26.1608 12.8316 16.9235 18.8020 26.1616 33.8936 40.0578 59.8994 70.6725 94.9825 107.6365 120.7547 152.3527 161.5607 183.5268 186.1532 193.4791 215.5519 222.1532 235.8883 241.7739 252.5287 275.5058 281.6046 288.6276 300.4126 301.7333 358.5640 394.5040 406.0491 412.4677 466.1661 508.7157 539.8926 569.2393 606.2131 627.3353 650.1249 674.0084 798.3847 805.0686 806.8085 809.2039 869.6981 870.8680 873.8843 879.4616 921.1953 927.8514 949.2870 961.0102 1005.4200 1015.8494 1021.7060 1043.8469 1046.2587 1091.1677 1102.5642 1105.1087 1108.3003 1113.1995 1130.1298 1131.5759 1170.9992 1228.3961 1250.5611 1255.0392 1275.7737 1303.2277 1313.9509 1351.5875 1355.4815 1356.9304 1370.4676 1380.4266 1392.2186 1393.0413 1393.6049 1400.7703 1454.1981 1455.2325 1456.7111 1457.1981 1463.7140 1472.1593 1474.2291 1476.9036 1477.2935 1485.3663 1488.2930 1492.0982 1504.3746 1532.9146 2980.6177 2982.9339 2990.0800 2991.4052 2993.8923 2995.4435 2995.9515 3034.7681 3054.8364 3057.6812 3075.8719 3080.1890 3081.9929 3088.2149 3090.3278 3092.1626 3095.8761 3107.1687 3108.6955 3110.8111 3174.1568
redmass: 1.9963 2.9299 3.3745 2.5510 3.1303 4.5356 2.4055 4.5255 1.0991 4.9412 3.7890 5.2265 4.2748 3.6569 6.0945 4.4217 5.2163 1.4135 1.8962 1.3952 1.2006 1.1103 3.9637 3.5623 4.5528 4.0161 3.7635 5.1392 3.1523 7.5175 5.3223 12.1833 4.7004 5.4524 4.7487 2.8776 6.1317 4.3244 6.4695 6.2094 1.0890 5.7355 1.0968 1.3731 3.6889 4.0033 3.1600 4.3286 1.1762 3.7999 1.4741 1.5576 2.6715 2.6806 10.2544 1.6490 1.8728 2.2061 2.2677 2.6835 1.9165 1.4140 1.4276 1.8931 5.5110 1.1486 1.1411 2.0809 3.9636 1.3139 1.2584 1.3154 2.8254 1.1905 1.8936 1.2439 1.2465 1.3517 1.4268 1.0478 1.0406 1.0406 1.3262 1.0464 1.0481 1.0607 1.0517 1.0504 1.0710 1.0797 1.1622 3.0501 5.1334 1.0344 1.0346 1.0515 1.0455 1.0367 1.0466 1.0418 1.0856 1.1080 1.1070 1.1002 1.0970 1.0999 1.1011 1.0980 1.0981 1.0996 1.1007 1.1023 1.1022 1.0940
irintensity: 2.7477 0.0281 1.0716 0.0700 0.0788 1.1660 3.8325 0.1447 0.4403 0.7140 1.5301 2.1146 0.3033 3.2405 9.1285 0.0766 18.8835 0.0759 0.2283 2.2751 0.0520 1.5892 13.4200 5.3552 16.2536 1.5696 5.0777 5.8352 2.2602 10.5935 18.2787 183.1583 1.9846 10.4368 0.0500 0.9234 126.8216 1.4059 90.4796 42.8865 3.4448 0.0672 2.4791 10.5323 118.7725 230.8611 9.4254 7.3014 4.2474 6.3848 0.3635 13.2066 142.2510 137.0791 45.8699 19.9799 24.0573 7.2695 35.6285 1.8985 16.6807 4.8268 5.0421 4.3724 4.8428 0.5454 1.7882 1.4877 66.3943 0.9798 7.0615 15.8290 12.4636 16.4547 2.2814 19.1402 28.7308 19.2125 26.0767 17.2959 11.4813 13.1124 153.1416 6.8701 0.6664 5.4871 20.1981 3.8790 11.8650 9.8088 4.4017 136.2785 319.9568 33.7101 29.8763 17.0860 20.5055 14.2214 39.4898 25.8551 1.6404 13.8981 11.8879 26.5446 9.2603 42.1267 7.1671 29.7819 25.0977 41.0569 17.6021 35.1660 35.6313 2.5715
temp: 298.150 k
press: 1.00000 atm
elementType: 16 15 8 8 8 7 7 6 6 6 6 6 6 6 6 6 6 6 6 1 1 1 1 1 1 1 1 1 1 1 1 1 1 1 1 1 1 1 1 1
symmnumber: 1
zpe: 835967.4 jmol-1
zpe.correction: 0.318403 hartree
zpe.thermalcorrener: 0.342039 hartree
zpe.thermalcorrenthalpy: 0.342983 hartree
zpe.thermalcorrgfe: 0.260243 hartree
zpe.sumelectzpe: -1542.839046 hartree
zpe.sumelectthermal: -1542.815410 hartree
zpe.sumelectthermalent: -1542.814466 hartree
zpe.sumelectthermalfe: -1542.897206 hartree
dipole: 0.3506 -0.9967 3.2765
dipole: 3.4427
quadrupole: -111.7860 -123.4038 -129.6827
quadrupole: 7.4304 -1.0522 2.3766
quadrupole: 9.8382 -1.7796 -8.0586 7.4304 -1.0522 2.3766
hfenergy: -1543.1574492 hartree
pointgroup: C01 [X(C12H21N2O3P1S1)]
dipole: -0.1369594 -0.1997395 -1.3326163 debye
polarizability: 274.6477857|-12.5288616|197.9226534|-5.1789212|17.805424|163.7321008 unknown
InChI: InChI=1S/C8H11N2S.C4H10O3P/c1-5(2)8-9-6(3)4-7(11)10-8;1-3-6-8(5)7-4-2/h4-5H,1-3H3;3-4H2,1-2H3
charge 0 multiplicity 1
40 atoms
S  -1.165265 -1.594842 -0.651191
P  -1.983484 0.220198 0.617212
O  -3.614639 -0.241537 0.191906
O  -1.761642 1.698466 -0.248601
O  -1.732712 0.365407 2.175052
N  0.845651 -0.010424 0.245232
N  3.212975 -0.483605 0.137301
C  2.437448 1.62033 1.196371
C  2.15527 0.308575 0.485463
C  3.353427 2.525115 0.3329
C  3.073358 1.342306 2.584668
C  0.585879 -1.19626 -0.36981
C  2.945021 -1.676086 -0.487656
C  1.61492 -2.081379 -0.764625
C  4.134441 -2.530999 -0.852053
C  -4.7034 0.015444 1.183569
C  -1.941849 1.722948 -1.728629
C  -5.974098 -0.557284 0.563149
C  -1.791998 3.184561 -2.141627
H  1.459087 2.11282 1.340747
H  4.316168 2.020733 0.138369
H  3.552063 3.474961 0.861696
H  2.883604 2.765463 -0.638501
H  2.398805 0.739977 3.21888
H  3.273167 2.296421 3.105265
H  4.027038 0.797951 2.466199
H  1.402469 -3.036021 -1.250993
H  4.814236 -1.970231 -1.518102
H  4.712865 -2.778941 0.055905
H  3.832527 -3.46626 -1.351014
H  -4.445705 -0.480214 2.137324
H  -4.786793 1.104895 1.360925
H  -1.164117 1.086201 -2.191275
H  -2.94013 1.317802 -1.980064
H  -6.82713 -0.406299 1.250678
H  -6.202968 -0.058477 -0.393987
H  -5.861117 -1.638601 0.3766
H  -1.898122 3.274416 -3.2388
H  -2.563676 3.809709 -1.661814
H  -0.799774 3.56906 -1.85137
