program: Gaussian 09
title: 000133896
version: EM64L-G09RevD.01
frameworkgroup: C1[X(C18H22O3)]
method: RPBEPBE
basis: SDD
operation: Freq
keyword: #pfreq=noraman
keyword: PBEPBE/SDD
title: #p freq=noraman PBEPBE/SDD
converged: YES YES NO NO
title: Mulliken charges:
elementType: O O O C C C C C C C C C C C C C C C C C C H H H H H H H H H H H H H H H H H H H H H H
charge: -0.439938 -0.488270 -0.436297 -0.255195 -0.252711 -0.400068 -0.400499 0.616202 0.553315 -0.706822 -0.706483 -0.509262 -0.490668 -0.446412 -0.371126 0.152862 -0.336314 -0.389417 -0.374326 0.116794 0.274679 0.203971 0.206640 0.229118 0.194977 0.229466 0.189927 0.203408 0.213373 0.232600 0.205762 0.232198 0.212425 0.252935 0.233354 0.232650 0.228205 0.218138 0.216428 0.246818 0.383342 0.372157 0.352063
chargesum: 0.00000
title: Mulliken charges with hydrogens summed into heavy atoms:
elementType: O O O C C C C C C C C C C C C C C C C C C
charge: -0.056596 -0.116113 -0.084234 -0.051224 -0.046071 0.024027 0.018894 0.616202 0.553315 -0.057441 -0.056098 -0.256327 -0.257313 -0.213762 -0.142922 0.152862 -0.118176 -0.172989 -0.127508 0.116794 0.274679
polarizability: 2.94300772e+02 -1.86207017e+01 1.39255244e+02 -6.69967164e+00 -1.04938897e+01 1.87314856e+02
1716.lowfreq: -7.8237 -3.5830 0.0008 0.0008 0.0011 9.5190 18.1381 31.5613 36.5016
frequency: 18.1256 31.5436 36.4537 44.2275 60.3616 61.6116 109.5705 129.6685 150.0777 158.6792 170.3547 184.8703 207.7808 225.6208 236.2092 238.9145 255.9784 280.4779 322.1811 339.1780 346.6726 347.0229 374.6348 400.6743 410.7716 432.9130 442.3119 470.6856 481.7446 487.8819 514.1073 550.8365 568.1648 576.6148 630.9803 639.7102 699.0903 709.2835 727.3510 739.9423 759.0236 789.2843 798.3055 808.0985 810.9871 834.2161 840.8605 876.7562 890.3867 901.9912 912.7237 932.4789 944.9874 958.4840 1002.6389 1010.6425 1034.4096 1046.4730 1056.8205 1072.9859 1087.4369 1094.6516 1105.3947 1124.6867 1141.3266 1145.1043 1159.4679 1180.3811 1182.5477 1206.0432 1219.6760 1232.4701 1242.0928 1247.1810 1248.9523 1268.6587 1297.6442 1299.4014 1302.5537 1323.6044 1334.2905 1335.7378 1355.5438 1386.3262 1387.0705 1390.9345 1406.2742 1426.4913 1461.8289 1466.9275 1470.0332 1473.9572 1474.2889 1483.8548 1484.2873 1501.6346 1502.5388 1595.8720 1607.6980 1624.7949 1629.4681 2954.1438 2964.3443 2973.5911 2973.9556 2974.5972 2981.8014 3036.7286 3037.8192 3066.6268 3066.8936 3079.5763 3080.1946 3108.3231 3116.2992 3123.4369 3134.4442 3143.3123 3150.8193 3165.8153 3526.7129 3582.9458 3624.6967
redmass: 4.8869 4.5598 4.2233 4.5494 3.3185 2.6814 2.4700 2.8459 3.2539 3.8394 2.7008 2.2697 4.2114 1.7048 1.6017 1.5782 1.4326 5.0407 3.1379 3.8936 3.6321 1.2394 4.4184 4.2595 2.9116 3.3264 3.4876 3.6154 1.1175 3.9857 3.1486 3.4500 3.3951 5.0302 5.0094 5.0748 3.3806 2.4938 2.6330 3.0327 4.4417 1.3815 1.8976 1.7010 1.6650 1.5803 1.9870 1.7129 1.9946 1.9416 1.3620 1.4108 2.4585 1.3680 2.8930 4.4591 1.7065 1.7660 1.7093 2.3061 2.1605 2.0776 1.6368 1.9807 1.3640 1.3180 2.0001 1.1141 1.3868 1.9763 1.3873 1.6111 1.5770 1.9988 1.5793 2.7854 1.2639 1.2762 1.3955 1.4063 1.3935 1.4526 1.5834 1.2318 1.2281 4.5014 4.0549 2.6233 2.0149 1.0700 1.2861 1.0451 1.0418 1.0645 1.0641 3.3252 2.7250 6.2873 6.8954 6.4685 6.7489 1.0798 1.0749 1.0368 1.0376 1.0628 1.0710 1.0966 1.0968 1.0994 1.0995 1.0999 1.0998 1.0873 1.0878 1.0889 1.0959 1.0950 1.0920 1.0951 1.0648 1.0660 1.0666
irintensity: 0.5740 2.4888 1.0406 0.1475 0.1154 0.3136 0.1058 0.2609 1.0119 0.3985 0.1947 0.2322 0.2274 19.5969 9.3423 38.7145 106.6638 6.8951 0.1059 3.6478 17.1350 125.2086 9.1601 5.0304 0.9454 10.4726 15.4201 9.1783 121.7950 1.4242 14.6785 9.2671 24.5070 2.7030 5.7236 11.1306 16.9114 5.1845 8.6601 3.0097 50.1262 41.0279 1.3656 18.1085 14.3059 42.7505 8.5348 14.7825 5.8732 6.2001 0.1689 0.8821 20.4632 0.1714 4.3631 0.5831 2.1273 9.2246 19.4460 176.1480 0.3933 26.0359 33.8847 21.0821 228.8619 3.5325 83.8683 8.0233 77.1823 0.5599 8.0589 36.9834 15.3109 37.3043 25.0651 138.2308 63.3974 6.9698 7.1138 2.9227 19.4262 14.1486 3.4578 27.5780 0.3069 11.1148 4.5591 11.3969 2.7598 2.6114 2.0803 8.1069 6.0723 8.4686 7.4365 119.7703 129.1869 10.9114 40.0434 30.0561 0.7992 0.0562 15.5178 56.8218 9.6182 0.5628 67.1369 3.5178 30.4914 21.1631 70.5642 15.2298 98.3118 22.5308 19.4751 17.7474 14.2422 15.6039 1.1977 7.0560 87.5344 41.3277 61.9050
temp: 298.150 k
press: 1.00000 atm
elementType: 8 8 8 6 6 6 6 6 6 6 6 6 6 6 6 6 6 6 6 6 6 1 1 1 1 1 1 1 1 1 1 1 1 1 1 1 1 1 1 1 1 1 1
symmnumber: 1
zpe: 932321.8 jmol-1
zpe.correction: 0.355103 hartree
zpe.thermalcorrener: 0.376631 hartree
zpe.thermalcorrenthalpy: 0.377575 hartree
zpe.thermalcorrgfe: 0.303446 hartree
zpe.sumelectzpe: -923.220341 hartree
zpe.sumelectthermal: -923.198812 hartree
zpe.sumelectthermalent: -923.197868 hartree
zpe.sumelectthermalfe: -923.271997 hartree
dipole: 1.5160 -0.0641 -1.0253
dipole: 1.8313
quadrupole: -105.5471 -132.3296 -117.5037
quadrupole: -0.3120 -24.4413 -0.7452
quadrupole: 12.9131 -13.8695 0.9564 -0.3120 -24.4413 -0.7452
hfenergy: -923.5754435 hartree
pointgroup: C01 [X(C18H22O3)]
dipole: -0.5963945 -0.0267514 0.4033369 debye
polarizability: 294.0052239|19.777644|139.7227841|-6.8857607|10.8208337|187.1428635 unknown
InChI: InChI=1S/C18H22O3/c1-3-15(12-5-8-14(19)9-6-12)16(4-2)13-7-10-17(20)18(21)11-13/h5-11,15-16,19-21H,3-4H2,1-2H3
charge 0 multiplicity 1
43 atoms
O  -4.400522 -0.577947 -2.095797
O  -5.880214 -0.420956 0.154796
O  6.318432 0.467297 -0.027962
C  -0.205382 0.665615 0.307555
C  0.629966 -0.603732 -0.114526
C  0.135799 1.896826 -0.583205
C  0.28739 -1.835253 0.775509
C  -1.708711 0.379932 0.307965
C  2.13304 -0.31863 -0.114509
C  -0.544637 3.201362 -0.117567
C  0.963839 -3.140548 0.306043
C  -2.375764 0.028582 -0.896284
C  -2.466992 0.469734 1.500597
C  2.895439 -0.397712 -1.30474
C  2.817213 0.024146 1.084276
C  -3.756468 -0.229754 -0.902345
C  -3.860326 0.214202 1.505617
C  4.286138 -0.144407 -1.313629
C  4.201187 0.282502 1.097814
C  -4.499868 -0.136064 0.304925
C  4.937898 0.19819 -0.106355
H  0.087711 0.918874 1.349146
H  0.334824 -0.856556 -1.155567
H  1.232891 2.035792 -0.588715
H  -0.157746 1.678537 -1.6306
H  -0.809956 -1.9722 0.782908
H  0.582582 -1.619129 1.823121
H  -0.253241 3.449608 0.921206
H  -0.250764 4.050914 -0.761067
H  -1.645622 3.115653 -0.146667
H  0.665864 -3.387657 -0.731019
H  2.065148 -3.056384 0.32877
H  0.672509 -3.990304 0.950512
H  -1.836386 -0.047854 -1.846209
H  -1.968254 0.741319 2.437535
H  2.395822 -0.661575 -2.24473
H  2.261869 0.089107 2.027842
H  -4.433423 0.288992 2.438649
H  4.852862 -0.213806 -2.251733
H  4.72602 0.546888 2.020875
H  -5.365226 -0.720976 -1.905963
H  -6.365551 -0.347101 1.010436
H  6.741911 0.383072 -0.918011
