program: Gaussian 09
title: 000133877
version: EM64L-G09RevD.01
frameworkgroup: C1[X(C23H22N2O4)]
method: RPBEPBE
basis: SDD
operation: Freq
keyword: #p
keyword: freq=noraman
keyword: PBEPBE/SDD
title: #p freq=noraman PBEPBE/SDD
converged: YES YES NO NO
title: Mulliken charges:
elementType: O O O O N N C C C C C C C C C C C C C C C C C C C C C C C H H H H H H H H H H H H H H H H H H H H H H
charge: -0.275686 -0.265289 -0.232374 -0.254775 -0.205251 -0.450715 0.353398 0.241805 -0.658637 -0.406654 -0.365335 -0.006078 -0.662040 0.316208 0.263314 -0.360653 -0.371316 0.435203 -0.361510 -0.428176 0.367935 -0.807224 -0.413547 -0.293223 0.486005 -0.316663 -0.438186 0.221480 -0.779887 0.266373 0.249786 0.257417 0.280172 0.282147 0.267019 0.236731 0.268429 0.268263 0.231165 0.232468 0.234086 0.225517 0.232887 0.257528 0.302487 0.315263 0.222293 0.304219 0.213249 0.260100 0.260271
chargesum: 0.00000
title: Mulliken charges with hydrogens summed into heavy atoms:
elementType: O O O O N N C C C C C C C C C C C C C C C C C C C C C C C
charge: -0.275686 -0.265289 -0.232374 -0.254775 -0.205251 -0.146496 0.353398 0.241805 -0.142477 -0.149237 -0.085164 -0.006078 0.123857 0.316208 0.263314 -0.092224 -0.103053 0.435203 -0.130346 -0.195708 0.367935 -0.114733 -0.156019 0.009264 0.486005 -0.001400 -0.215893 0.221480 -0.046267
polarizability: 4.44538458e+02 1.03627642e+01 2.69259658e+02 2.44637732e+01 1.41665171e+01 2.13658101e+02
1716.lowfreq: -34.8450 -4.0478 -0.0008 -0.0007 0.0010 2.0938 2.6590 6.5284 15.4789
frequency: -34.7985 6.4419 15.3536 22.3484 31.3380 34.6572 37.7598 53.1950 56.7988 69.3058 79.3774 81.9959 93.0496 103.6197 113.0855 145.2089 166.9950 192.3705 206.9564 225.5222 237.0518 252.8052 273.4573 298.7307 313.6411 326.3795 348.0161 373.6723 378.9424 388.6200 392.9342 410.4685 415.0049 427.4966 481.2666 490.9283 523.3883 534.8055 553.0631 595.7061 597.6068 617.7814 621.8504 624.3767 635.8603 642.0394 642.4696 681.3405 709.9644 715.3208 722.9270 735.6965 748.1906 769.6799 786.3539 803.0500 830.2718 832.4460 842.5302 858.4403 861.0659 870.9984 880.9268 893.0508 930.2372 932.9277 962.2922 963.4613 971.5231 984.7872 990.4049 991.0748 993.1820 1005.3541 1014.1978 1040.1661 1044.8580 1047.3167 1083.3289 1120.2810 1123.2677 1126.0420 1137.4040 1149.0690 1170.2058 1192.4809 1194.4727 1199.1538 1217.3959 1223.1326 1232.1066 1260.5538 1267.1885 1296.1421 1301.9989 1307.9433 1348.2457 1367.0394 1368.2990 1370.5060 1389.8572 1397.3318 1407.3439 1412.0757 1414.3756 1443.9441 1448.5580 1459.1007 1469.1044 1469.7435 1471.1915 1473.3221 1479.1444 1487.8261 1491.1079 1501.6896 1504.6654 1509.5132 1538.6454 1577.5308 1592.8993 1618.8125 1618.8289 1627.3426 1630.6338 2977.1797 2995.9551 2999.2628 3026.7053 3055.3009 3086.3548 3092.5798 3097.8237 3098.9551 3107.7831 3119.1218 3122.2166 3125.4242 3148.4021 3154.6020 3158.9426 3165.0802 3198.9882 3212.0872 3212.8951 3236.1487 3534.5531
redmass: 1.4165 6.4481 4.0882 1.0527 4.6923 4.7987 4.7904 1.2435 3.1590 4.2720 3.0848 5.6875 5.3240 4.2873 4.9821 5.0728 6.0953 6.1469 5.5927 4.3291 4.5564 3.7750 4.6997 5.5168 3.4889 5.5762 3.2964 4.6735 4.5092 3.8475 4.6424 2.9582 3.0740 3.6590 2.9739 3.8036 2.6424 4.6967 4.6313 3.2348 5.3813 6.1496 4.8318 5.7525 6.7807 1.2677 3.9676 5.1812 3.9713 5.1848 3.6070 6.9235 2.1454 2.2723 4.6763 2.9173 1.3616 4.9770 1.6444 1.2946 1.5180 4.1956 1.5829 5.5693 2.2688 5.4639 1.3580 2.4520 1.3647 1.4023 1.4055 1.3187 1.6737 2.5841 2.7733 1.6319 1.3084 1.5708 2.1138 1.2922 1.3133 1.3122 2.1762 2.4471 3.4345 1.1817 1.2965 1.6296 3.4382 2.9824 1.6231 3.3619 1.9864 1.4519 1.4027 1.2939 4.7370 5.2219 4.8342 5.8269 1.2226 1.2467 3.4566 2.4914 4.0338 1.1146 1.0450 1.8835 1.0459 1.0963 1.2247 1.0976 2.0868 2.2095 1.6118 2.7131 2.4926 3.4060 5.2661 6.3036 6.6337 6.1886 6.1714 4.9976 9.8302 1.0373 1.0363 1.0386 1.0622 1.0974 1.0988 1.0995 1.1006 1.0979 1.0999 1.0911 1.0890 1.0888 1.0992 1.0944 1.0958 1.0910 1.0954 1.0943 1.0932 1.1036 1.0766
irintensity: 0.3371 0.1216 4.5753 0.6934 1.6895 1.3285 0.1737 0.9752 1.5410 7.0578 0.1277 1.8102 4.0761 4.1882 1.0601 0.9331 3.4074 1.4759 0.1817 3.8663 1.4621 7.6694 5.0308 9.6239 5.3826 3.0444 3.2171 0.4389 5.0960 8.3214 3.3524 0.5001 0.2526 1.5034 12.3610 0.0839 26.2931 19.9353 15.3986 0.3222 10.4440 9.3857 7.3822 9.5573 0.3913 53.2596 2.9793 2.4295 12.0937 7.5911 0.3674 13.1574 58.5913 15.8400 13.4755 11.3442 30.1035 0.1036 29.7477 8.0184 90.2476 73.2011 8.5693 46.3932 12.3750 1.9263 0.3798 30.3299 2.1087 0.4158 19.8701 2.1657 11.0259 24.7007 3.8472 14.8358 13.2311 14.2422 414.6938 19.8133 13.3258 2.9060 73.9980 163.5849 94.2488 120.8596 38.1030 109.3752 90.3611 5.7783 224.5028 134.8367 2.4975 34.1689 34.1425 3.1002 6.1170 47.5762 125.2566 183.6920 54.0019 10.3547 0.7140 62.7418 17.7539 23.6068 15.2755 126.6945 12.5356 21.3160 17.3336 19.9738 128.4889 43.6556 38.4076 8.4533 615.1159 32.4915 94.3754 16.9005 46.7752 73.7474 94.6460 86.0146 174.2175 35.5258 13.1656 35.8628 13.5755 18.8344 17.9411 6.1658 19.6323 6.6846 2.3385 19.3870 18.2059 20.3616 1.1817 15.4817 2.6933 2.3754 8.7379 2.7002 5.1349 0.6280 12.3754
temp: 298.150 k
press: 1.00000 atm
elementType: 8 8 8 8 7 7 6 6 6 6 6 6 6 6 6 6 6 6 6 6 6 6 6 6 6 6 6 6 6 1 1 1 1 1 1 1 1 1 1 1 1 1 1 1 1 1 1 1 1 1 1
symmnumber: 1
zpe: 1046523.0 jmol-1
zpe.correction: 0.398600 hartree
zpe.thermalcorrener: 0.425706 hartree
zpe.thermalcorrenthalpy: 0.426650 hartree
zpe.thermalcorrgfe: 0.334996 hartree
zpe.sumelectzpe: -1298.012779 hartree
zpe.sumelectthermal: -1297.985673 hartree
zpe.sumelectthermalent: -1297.984728 hartree
zpe.sumelectthermalfe: -1298.076382 hartree
dipole: 2.3166 2.2618 -1.4839
dipole: 3.5616
quadrupole: -153.5178 -157.0360 -167.5563
quadrupole: -10.4773 -33.1862 -10.8700
quadrupole: 5.8522 2.3341 -8.1863 -10.4773 -33.1862 -10.8700
hfenergy: -1298.4113785 hartree
pointgroup: C01 [X(C23H22N2O4)]
dipole: 0.9095421 1.0204729 0.3079107 debye
polarizability: 443.1243145|-13.3737253|223.8387908|28.5386388|25.2175577|260.4931123 unknown
InChI: InChI=1S/C23H22N2O4/c1-15-4-6-17(7-5-15)23(28)21-13-10-19(25(21)3)14-22(27)29-20-11-8-18(9-12-20)24-16(2)26/h4-13,24H,14H2,1-3H3
charge 0 multiplicity 1
51 atoms
O  2.286492 -1.586923 -0.682784
O  -4.715106 -0.314178 -2.289714
O  1.361372 -0.480941 -2.544898
O  7.839253 0.299954 2.342312
N  -2.000412 -1.256566 -1.606246
N  6.874316 1.506576 0.573232
C  -0.99696 -1.931311 -0.915937
C  -3.003228 -0.866341 -0.689157
C  0.248535 -2.468391 -1.580323
C  -1.351065 -1.98671 0.449566
C  -2.596907 -1.320915 0.593456
C  -4.273181 -0.241453 -1.087534
C  -1.974541 -0.9783 -3.058308
C  -5.084826 0.479105 -0.046414
C  1.336612 -1.397345 -1.694003
C  -6.492495 0.549349 -0.232218
C  -4.511949 1.157485 1.061207
C  -6.73781 1.9198 1.79844
C  -7.303384 1.247993 0.679168
C  -5.330943 1.868228 1.965739
C  3.42081 -0.741867 -0.446495
C  -7.619754 2.678777 2.773338
C  4.247235 -1.195288 0.603411
C  3.730623 0.443083 -1.153846
C  5.728114 0.717583 0.26971
C  5.399848 -0.476378 0.969041
C  4.885526 1.160214 -0.783682
C  7.849492 1.288522 1.551314
C  8.949291 2.346915 1.600706
H  0.635703 -3.309591 -0.985951
H  0.029593 -2.829425 -2.600987
H  -0.762701 -2.464912 1.230821
H  -3.182692 -1.219828 1.504397
H  -2.676912 -0.165331 -3.281213
H  -0.953919 -0.692443 -3.359382
H  -2.308335 -1.864165 -3.628244
H  -6.92335 0.050674 -1.106833
H  -3.425534 1.160525 1.195796
H  -8.389178 1.280657 0.52575
H  -4.870313 2.397911 2.808257
H  -8.175792 3.488069 2.263462
H  -7.028447 3.135107 3.585342
H  -8.371964 2.011817 3.235122
H  3.976633 -2.115167 1.130191
H  3.095917 0.793128 -1.967656
H  6.044794 -0.818777 1.77937
H  5.130579 2.080595 -1.329335
H  6.993274 2.341902 -0.003947
H  8.837838 3.149752 0.851198
H  8.964091 2.800145 2.606878
H  9.925658 1.854683 1.451483
