program: Gaussian 09
title: 000133825
version: EM64L-G09RevD.01
frameworkgroup: C1[X(C8H7ClO3)]
method: RPBEPBE
basis: SDD
operation: Freq
keyword: #p
keyword: freq=noraman
keyword: PBEPBE/SDD
title: #p freq=noraman PBEPBE/SDD
converged: YES YES NO NO
title: Mulliken charges:
elementType: Cl O O O C C C C C C C C H H H H H H H
charge: -0.061117 -0.438238 -0.417363 -0.219862 0.384927 -0.627438 0.195612 -0.363307 -0.371665 -0.248905 -0.064793 0.208107 0.278254 0.258028 0.239200 0.249413 0.257037 0.365027 0.377081
chargesum: 0.00000
title: Mulliken charges with hydrogens summed into heavy atoms:
elementType: Cl O O O C C C C C C C C
charge: -0.061117 -0.073210 -0.040282 -0.219862 0.384927 -0.091156 0.195612 -0.124107 -0.122252 0.008132 -0.064793 0.208107
polarizability: 1.49006747e+02 2.36990956e+00 9.75586710e+01 -1.27111282e+01 4.09386105e+00 6.07449395e+01
1716.lowfreq: -7.5988 -0.0016 0.0016 0.0024 4.4877 10.3182 30.8913 46.0863 58.5288
frequency: 30.8495 46.0542 58.5101 146.4888 206.3780 219.5096 273.5216 291.8394 318.3725 356.8035 411.2250 444.8485 457.0488 497.4206 541.9332 565.4596 591.1690 636.9714 659.6254 714.5649 783.1415 810.4410 831.2242 860.4376 873.4159 927.1802 946.9070 1043.6970 1071.8989 1093.5294 1149.3884 1185.4256 1209.9248 1241.8418 1256.3095 1300.7178 1339.9370 1391.7511 1399.8653 1435.4050 1494.0657 1607.8293 1609.5265 1679.5006 3010.7567 3067.1669 3138.1604 3147.5253 3181.0091 3517.1121 3593.7939
redmass: 6.4648 8.0354 9.0408 7.6715 5.5014 6.1330 2.8681 10.4511 2.3391 1.6302 5.9933 3.1240 2.8269 2.4954 5.8520 5.6820 4.2748 1.4155 5.7821 4.1198 2.4582 1.9349 1.5399 3.6647 5.9980 2.1431 1.4440 2.6337 2.1138 1.9585 1.2225 1.1608 1.7620 1.9509 1.9837 1.4107 1.9881 5.9783 3.8261 1.1607 2.9666 7.5061 7.1452 8.4852 1.0605 1.0993 1.0904 1.0927 1.0956 1.0640 1.0663
irintensity: 0.1228 0.9132 0.9557 2.6548 0.2726 1.1691 7.3334 0.3006 47.2686 87.8564 27.3349 10.3029 7.9640 26.8040 25.1949 3.3193 24.2667 122.8249 5.1901 1.8535 11.1705 17.5123 41.8331 18.9464 114.1582 22.9428 1.3004 328.8239 53.3983 73.6602 48.8135 6.5216 13.9725 24.2836 12.7858 17.6447 69.3254 30.4770 15.0491 37.1305 91.2974 42.3608 61.5344 188.2990 11.6966 1.1496 10.4619 2.5031 1.6954 23.2351 42.9565
temp: 298.150 k
press: 1.00000 atm
elementType: 17 8 8 8 6 6 6 6 6 6 6 6 1 1 1 1 1 1 1
symmnumber: 1
zpe: 350909.4 jmol-1
zpe.correction: 0.133654 hartree
zpe.thermalcorrener: 0.145026 hartree
zpe.thermalcorrenthalpy: 0.145970 hartree
zpe.thermalcorrgfe: 0.094669 hartree
zpe.sumelectzpe: -993.914242 hartree
zpe.sumelectthermal: -993.902871 hartree
zpe.sumelectthermalent: -993.901927 hartree
zpe.sumelectthermalfe: -993.953228 hartree
dipole: 1.3498 0.6731 -1.3065
dipole: 1.9955
quadrupole: -76.4891 -62.1752 -82.2016
quadrupole: -1.8653 1.3042 1.5183
quadrupole: -2.8671 11.4467 -8.5797 -1.8653 1.3042 1.5183
hfenergy: -994.0478968 hartree
pointgroup: C01 [X(C8H7Cl1O3)]
dipole: -0.5005442 -0.3843938 -0.466953 debye
dipolederiv: -0.8294427 -0.0150509 -0.1629905 0.0209365 -0.1330012 0.0184383 -0.1869853 0.0119355 -0.117635 -0.5015644 -0.5216389 0.1198491 -0.5338118 -1.050132 -0.0122332 0.135432 -0.0260784 -0.343557 -1.4131347 -0.0977088 -0.3041574 -0.1235275 -0.4322304 -0.0301116 -0.1278844 -0.0266131 -0.3046006 -0.7287701 -0.0356113 0.0120921 -0.0494655 -0.2853528 -0.0401053 -0.1659273 -0.0825806 -0.9134394 0.1974918 0.0539838 -0.0027489 -0.2136981 -0.2690977 -0.0006913 0.0719361 0.0670898 -0.0979648 -0.0198782 -0.0587235 0.0938156 -0.086624 0.1285444 0.0066873 0.2652961 -0.0095444 -0.182621 0.4380619 0.4912748 -0.0336868 0.4833176 0.9863316 -0.0804278 -0.0825368 -0.0841446 0.1009578 0.1715786 0.0048583 0.0837366 0.1348994 0.1344909 -0.0294181 0.0445122 -0.0431749 -0.1003126 -0.4670225 -0.2923607 0.002473 -0.01128 -0.1882431 -0.0000325 -0.0632918 -0.0785121 -0.1587258 -0.470366 0.0676692 -0.0756724 0.1255403 -0.1208873 0.018728 -0.1008075 0.012632 -0.1670109 1.1924633 0.0676877 0.2708597 -0.1127333 0.3099363 -0.1029658 0.3276852 -0.0702375 0.0511942 1.7386249 0.1626465 0.1259866 0.2174013 0.2254219 0.0626759 0.0179069 0.1054551 1.2040603 0.0162861 -0.0239455 -0.0134332 -0.0503235 0.042046 -0.0819266 -0.0232484 -0.0407675 0.0756296 0.0356388 0.0139575 0.0139757 0.0745807 -0.0151519 0.0940362 -0.0191596 0.047844 0.0752152 0.0320104 0.0836864 -0.0565479 0.069888 -0.0230224 0.0517452 -0.0490468 0.0588252 0.120312 0.0744533 0.0239837 -0.0276798 0.0318602 -0.0321526 0.0575265 -0.0352312 0.0594219 0.159886 0.0476624 -0.0716888 -0.0108105 -0.0697721 0.0120153 0.024923 -0.0190376 0.0240675 0.1687252 0.1813042 0.1493823 -0.090401 0.1093922 0.3307058 0.0482736 -0.0912529 0.0763595 0.3292737 0.3046033 -0.0024018 0.05534 -0.0165802 0.3797792 -0.0051218 0.1016411 -0.0019772 0.100613 unknown
polarizability: 147.6325643|7.5321444|95.0574613|15.0302119|-10.153504|64.6203319 unknown
InChI: InChI=1S/C8H7ClO3/c9-6-2-1-5(3-8(11)12)7(10)4-6/h1-2,4,10-11H,3H2
charge 0 multiplicity 1
19 atoms
Cl 4.268964 0.167224 0.55116
O  -0.425498 -2.106461 -0.054842
O  -3.952728 -0.052755 -0.090038
O  -2.302028 0.23486 1.517799
C  -0.242303 0.22763 -0.565201
C  -1.714301 0.214817 -0.908722
C  0.388242 -0.964348 -0.119311
C  0.544039 1.39545 -0.657961
C  1.75993 -0.994019 0.220965
C  1.91912 1.403224 -0.323909
C  2.498091 0.19896 0.112396
C  -2.620285 0.135138 0.31704
H  -1.971645 -0.646527 -1.551106
H  -1.998208 1.124751 -1.469145
H  0.074768 2.327195 -0.993701
H  2.242417 -1.916675 0.561748
H  2.514398 2.316385 -0.398499
H  0.05895 -2.877001 0.33083
H  -4.535423 -0.090248 0.716296
