program: Gaussian 09
title: 000011922
version: EM64L-G09RevD.01
frameworkgroup: C1[X(C7H4N2O2)]
method: RPBEPBE
basis: SDD
operation: Freq
keyword: #pfreq=noraman
keyword: PBEPBE/SDD
title: #p freq=noraman PBEPBE/SDD
converged: NO NO NO YES
title: Mulliken charges:
elementType: O O N N C C C C C C C H H H H
charge: -0.196739 -0.163498 0.023317 0.003096 0.239984 0.299700 -0.335455 -0.337336 -0.194766 -0.214618 -0.195055 0.294965 0.273167 0.251411 0.251829
chargesum: 0.00000
title: Mulliken charges with hydrogens summed into heavy atoms:
elementType: O O N N C C C C C C C
charge: -0.196739 -0.163498 0.023317 0.003096 0.239984 0.299700 -0.040491 -0.064169 0.056645 0.037211 -0.195055
polarizability: 1.24774920e+02 1.20374273e+01 1.23678504e+02 -2.54941977e-03 -7.61162709e-03 3.59559947e+01
1716.lowfreq: 0.0002 0.0006 0.0007 6.7224 7.9009 14.9949 44.2251 116.0017 164.3379
frequency: 44.0642 115.9981 164.3370 187.2553 239.0237 359.4359 382.4323 424.0661 432.2841 518.5632 563.5585 578.0013 647.6799 662.0287 740.5081 740.7810 790.4092 807.8261 904.0803 987.3529 1011.0471 1034.7139 1061.8972 1141.6835 1176.8953 1197.2474 1206.8581 1269.2971 1371.4705 1383.3804 1434.0420 1470.0247 1573.6008 1608.2163 2173.6737 3151.3950 3164.7619 3177.9656 3188.8804
redmass: 15.0067 4.9332 13.1199 6.2605 7.5851 10.5803 4.8936 13.1830 4.0724 8.9192 4.2537 7.2357 7.3756 4.9605 8.2321 4.5821 1.3537 7.7172 1.3778 1.3769 1.3500 2.6337 3.6322 1.9107 1.1115 2.8618 9.4784 1.5073 12.4656 4.8247 2.6524 2.5290 6.2566 7.0901 12.6307 1.0872 1.0918 1.0966 1.0983
irintensity: 0.4086 0.0345 1.2100 1.3619 3.9493 1.8409 0.0548 1.3820 0.6106 1.3499 7.4820 0.1752 9.1313 17.0363 13.7629 10.3389 75.1535 11.9824 0.1254 4.6976 0.3643 2.2099 9.8001 2.6743 12.1411 12.1559 196.9932 0.3363 115.6552 2.7801 8.1863 29.4738 15.5519 0.8869 1.1589 1.6328 5.6155 2.7742 7.9661
temp: 298.150 k
press: 1.00000 atm
elementType: 8 8 7 7 6 6 6 6 6 6 6 1 1 1 1
symmnumber: 1
zpe: 257715.9 jmol-1
zpe.correction: 0.098159 hartree
zpe.thermalcorrener: 0.106979 hartree
zpe.thermalcorrenthalpy: 0.107923 hartree
zpe.thermalcorrgfe: 0.063428 hartree
zpe.sumelectzpe: -528.227134 hartree
zpe.sumelectthermal: -528.218314 hartree
zpe.sumelectthermalent: -528.217370 hartree
zpe.sumelectthermalfe: -528.261864 hartree
dipole: -7.2225 -1.3380 -0.0003
dipole: 7.3454
quadrupole: -62.1603 -69.4041 -62.6640
quadrupole: -2.4643 -0.0007 0.0017
quadrupole: 2.5825 -4.6613 2.0787 -2.4643 -0.0007 0.0017
hfenergy: -528.3252926 hartree
pointgroup: C01 [X(C7H4N2O2)]
dipole: -2.8894774 -0.0485492 -0.000122 debye
dipolederiv: -0.4731547 0.1172523 0.0000068 0.0472308 -0.8589069 0.0001089 0.0000406 0.0002863 -0.2242209 -0.6766938 -0.0467276 0.0001906 -0.0182187 -0.5463966 0.0001527 0.0000188 0.000055 -0.1906725 1.3101035 -0.3052003 -0.000184 -0.1804273 1.3022303 -0.0003287 -0.0001601 -0.0002961 0.2008263 -0.1710761 0.0524933 0.0000328 -0.0085768 -0.2654009 0.0000346 0.0000214 0.0000083 -0.2310372 -0.3123271 0.3342101 -0.0000019 0.2645096 -0.1180581 0.0000494 0.000052 -0.0000179 0.0501653 0.1269167 0.098115 -0.0000067 -0.1615711 0.2443643 0.0000027 0.0000828 -0.000053 0.1449768 -0.078625 -0.2458182 0.0000111 0.0646845 -0.0203179 0.0000071 -0.000006 -0.000001 -0.0882421 -0.276419 -0.0144608 0.0000085 -0.0756164 0.0896519 -0.0000044 0.0000201 0.0000138 -0.127395 0.10973 0.2004934 -0.0000264 0.0966736 -0.1347123 -0.0000076 -0.0000446 -0.0000164 -0.1296434 0.1963634 -0.0816237 -0.0000135 -0.0165697 0.0529753 -0.0000049 -0.0000084 0.0000039 -0.111463 0.0788375 -0.1155866 -0.0000354 -0.0011351 0.1106288 -0.0000162 -0.0000565 0.0000037 0.0482723 0.1381186 0.024226 -0.0000006 -0.0134321 0.0562333 -0.0000055 0.0000255 0.0000037 0.1723039 0.0918034 -0.0145712 0.000002 0.0072956 -0.0251851 0.0000041 -0.0000147 0.0000019 0.1631809 -0.0280289 -0.0632672 0.0000108 -0.0759988 0.0474875 0.0000091 0.000012 0.0000166 0.1600125 -0.0355484 0.0604655 0.0000059 0.0711519 0.0654063 -0.0000015 0.0000173 -0.000009 0.1629363 unknown
polarizability: 128.6769816|11.1980038|119.7764424|-0.0037748|-0.0070843|35.9559947 unknown
InChI: InChI=1S/C7H4N2O2/c8-5-6-3-1-2-4-7(6)9(10)11/h1-4H
charge 0 multiplicity 1
15 atoms
O  1.173575 -2.625976 0.000503
O  2.321107 -0.653387 -0.000291
N  1.227206 -1.33554 -0.000138
N  1.944959 2.509164 -0.000043
C  -0.060367 -0.591866 -0.000044
C  -0.082603 0.83292 -0.000076
C  -1.249819 -1.348547 0.000059
C  -1.351838 1.476555 -0.000019
C  -2.494965 -0.688844 0.000108
C  -2.544717 0.725023 0.000059
C  1.085023 1.677048 -0.000148
H  -1.176184 -2.439126 0.000094
H  -1.383316 2.570075 -0.000043
H  -3.418751 -1.27536 0.000189
H  -3.509212 1.242363 0.000091
