program: Gaussian 09
title: 000133794
version: EM64L-G09RevD.01
frameworkgroup: C1[X(C8H10N2O2)]
method: RPBEPBE
basis: SDD
operation: Freq
keyword: #p
keyword: freq=noraman
keyword: PBEPBE/SDD
title: #p freq=noraman PBEPBE/SDD
converged: YES YES NO NO
title: Mulliken charges:
elementType: O O N N C C C C C C C C H H H H H H H H H H
charge: -0.270322 -0.270323 -0.689034 -0.689058 0.248965 0.248952 -0.315527 -0.315510 -0.537546 -0.537528 0.290076 0.290067 0.220294 0.223671 0.220290 0.223670 0.236434 0.236434 0.293313 0.299691 0.299679 0.293315
chargesum: 0.00000
title: Mulliken charges with hydrogens summed into heavy atoms:
elementType: O O N N C C C C C C C C
charge: -0.270322 -0.270323 -0.096031 -0.096065 0.248965 0.248952 0.128438 0.128450 -0.301112 -0.301095 0.290076 0.290067
polarizability: 1.64838010e+02 7.24058244e-04 1.07923006e+02 5.93570776e-04 -1.55476527e-01 5.58469942e+01
1716.lowfreq: -13.2677 -7.3743 -0.0005 0.0003 0.0004 4.5733 90.1366 114.9035 173.9312
frequency: 90.0896 114.9013 173.9309 206.6508 251.7234 270.2388 298.2586 331.9762 391.4475 406.9432 414.7054 435.2539 468.5940 501.5400 510.0537 534.6261 601.4418 625.0499 655.9905 704.0221 705.6757 721.5222 796.5962 830.6074 847.0622 877.9171 881.6766 1003.7265 1028.5844 1059.9831 1075.9654 1086.5896 1098.3815 1174.5224 1199.0386 1225.6133 1250.1727 1270.5575 1343.2598 1350.8604 1360.5046 1405.2334 1437.9858 1455.8289 1462.1016 1521.5861 1601.7800 1611.0931 1640.1510 1652.3750 2984.4338 2994.1482 3091.5192 3092.6884 3143.6276 3146.3256 3494.4146 3495.3502 3638.8613 3643.0731
redmass: 3.4303 4.5013 1.3594 2.4242 2.9670 4.4477 3.4319 2.6619 5.0129 5.6859 6.3040 3.0139 1.1223 2.5465 8.9341 1.5065 1.1666 2.7540 6.6616 3.2183 3.5340 6.8635 3.6304 1.6216 1.4197 2.6578 3.4661 2.7996 3.4009 1.4900 1.3310 1.9591 6.9038 1.8820 1.2414 1.8315 1.1741 1.8407 1.8449 1.2953 2.6893 4.9260 2.9555 1.0961 1.3107 4.8003 8.2334 1.3406 1.1096 3.9647 1.0682 1.0617 1.0972 1.1033 1.0910 1.0918 1.0467 1.0464 1.0987 1.0993
irintensity: 13.8875 0.0055 11.9500 3.7680 1.4044 5.1107 0.5998 6.6013 35.8162 2.0685 0.0432 6.2193 4.4599 27.6701 2.8952 292.2007 351.8113 26.4269 11.8466 9.7147 16.3357 4.8868 1.9258 0.1888 78.6463 48.0097 7.9878 3.3415 55.5929 0.0709 27.4886 0.0016 12.7329 236.3421 6.6512 33.6858 34.5441 13.4551 26.1169 2.6062 20.5914 102.2674 3.4248 0.0127 15.5675 370.8958 4.7143 52.7067 80.7767 47.8614 65.4654 62.5739 47.8212 21.9690 14.8045 1.0395 4.0995 26.2105 35.1882 0.0444
temp: 298.150 k
press: 1.00000 atm
elementType: 8 8 7 7 6 6 6 6 6 6 6 6 1 1 1 1 1 1 1 1 1 1
symmnumber: 1
zpe: 458701.1 jmol-1
zpe.correction: 0.174710 hartree
zpe.thermalcorrener: 0.185401 hartree
zpe.thermalcorrenthalpy: 0.186345 hartree
zpe.thermalcorrgfe: 0.139230 hartree
zpe.sumelectzpe: -569.889933 hartree
zpe.sumelectthermal: -569.879242 hartree
zpe.sumelectthermalent: -569.878298 hartree
zpe.sumelectthermalfe: -569.925413 hartree
dipole: 0.8954 -0.0001 0.0004
dipole: 0.8954
quadrupole: -47.5482 -66.5994 -73.4550
quadrupole: -0.0005 0.0000 -1.7319
quadrupole: 14.9860 -4.0652 -10.9208 -0.0005 0.0000 -1.7319
hfenergy: -570.0646428 hartree
pointgroup: C01 [X(C8H10N2O2)]
dipole: -0.3522649 0.0000552 0.0001675 debye
dipolederiv: -1.4162968 0.2107357 -0.081617 0.3188603 -0.4387828 0.0450134 0.0147248 0.0123733 -0.2851479 -1.4163148 -0.2107909 0.081775 -0.3189357 -0.4387984 0.0450655 -0.014554 0.0124234 -0.285146 -1.1956875 -0.4579412 0.1614143 -0.4472286 -0.3956519 -0.1014706 0.315331 0.0360406 -0.5544706 -1.1956995 0.4578104 -0.1613993 0.4469769 -0.3956014 -0.1016505 -0.3152332 0.0358298 -0.5542809 0.7875657 -0.1876456 0.040437 -0.9057351 0.1985093 -0.057816 -0.0805347 -0.0568491 0.0081237 0.7875103 0.187756 -0.040562 0.9058024 0.1984206 -0.057938 0.0804096 -0.0568745 0.0081123 0.7306092 -0.0035863 0.102583 0.3796756 0.1498353 0.0744495 0.1373181 0.0613776 0.3330197 0.730658 0.0036152 -0.1026308 -0.3796483 0.1498171 0.0744914 -0.1373505 0.061381 0.3330419 -0.1766764 -0.1052518 -0.0085164 0.0613444 0.0347665 0.0185366 -0.1020367 -0.0142518 -0.2112453 -0.1765303 0.1051111 0.0084908 -0.0612989 0.0347771 0.0185503 0.1020506 -0.0142895 -0.2112408 0.8704218 0.4625181 -0.0346923 0.9370161 0.2038815 0.0403754 0.0367343 0.0905814 0.0215175 0.8702537 -0.4623406 0.0346 -0.9369852 0.2038418 0.0405504 -0.0369335 0.0906786 0.021477 -0.1262726 0.0816949 0.0120172 0.1283791 0.017883 -0.0222508 0.0424948 -0.0344426 0.0899894 0.0110157 -0.010341 0.0260039 -0.1281963 0.0545678 -0.0563163 -0.1044944 -0.0075915 -0.1674186 -0.1262743 -0.0817007 -0.0120108 -0.1283843 0.0178719 -0.0222499 -0.0424914 -0.0344461 0.0899826 0.011002 0.0103332 -0.0259896 0.1281997 0.054577 -0.0563304 0.1045022 -0.0075892 -0.1674278 0.084862 -0.0195561 0.0042649 -0.0189972 -0.0862382 -0.0138378 0.0131284 -0.0091698 0.1761319 0.0848605 0.0195629 -0.0042521 0.0190029 -0.0862403 -0.0138469 -0.0131167 -0.0091782 0.1761288 0.1952347 0.0702532 -0.0442788 0.0260473 0.0969572 -0.0015671 -0.0750044 -0.062899 0.3294476 0.2352269 0.0079945 -0.0687725 -0.0115448 0.1643558 0.0748567 -0.2243034 -0.0151554 0.2600617 0.2352858 -0.0079733 0.0688027 0.0116679 0.1643239 0.0748972 0.224358 -0.01513 0.2599291 0.1952462 -0.0702577 0.0443328 -0.0260182 0.096927 -0.0015121 0.0750012 -0.0628188 0.3294145 unknown
polarizability: 164.8380095|0.0014613|107.9218791|-0.0081441|-0.2878825|55.8481221 unknown
InChI: InChI=1S/C8H10N2O2/c9-5-3-7-8(4-6(5)10)12-2-1-11-7/h3-4H,1-2,9-10H2
charge 0 multiplicity 1
22 atoms
O  1.822451 -1.471211 0.008676
O  1.822407 1.471244 -0.00912
N  -3.083993 -1.376988 -0.063872
N  -3.084039 1.376879 0.064222
C  0.620765 -0.708457 0.000798
C  0.620752 0.708446 -0.001029
C  2.997189 -0.662012 0.386938
C  2.997175 0.662073 -0.387345
C  -0.602039 -1.411334 -0.031522
C  -0.60207 1.411281 0.031521
C  -1.830724 -0.716863 -0.034866
C  -1.830736 0.716779 0.035036
H  3.87533 -1.279393 0.136283
H  2.975853 -0.463715 1.477275
H  3.875291 1.279484 -0.136679
H  2.975866 0.463773 -1.477682
H  -0.571998 -2.505905 -0.069147
H  -0.572063 2.505852 0.06917
H  -3.079078 -2.395741 -0.081717
H  -3.821383 -0.930308 -0.612954
H  -3.821238 0.930375 0.613709
H  -3.079117 2.395641 0.081805
