program: Gaussian 09
title: 000133734
version: EM64L-G09RevD.01
frameworkgroup: C1[X(C18H14N4O3)]
method: RPBEPBE
basis: SDD
operation: Freq
keyword: #p
keyword: freq=noraman
keyword: PBEPBE/SDD
title: #p freq=noraman PBEPBE/SDD
converged: YES YES NO NO
title: Mulliken charges:
elementType: O O O N N N N C C C C C C C C C C C C C C C C C C H H H H H H H H H H H H H H
charge: -0.271433 -0.235138 -0.196489 -0.431493 0.022856 -0.005019 0.001971 0.272546 0.354315 0.301057 0.011805 -0.285940 -0.403614 -0.366668 -0.389115 0.254509 -0.224172 -0.233699 0.124573 0.023604 0.146470 -0.780497 -0.350465 -0.779583 -0.354167 0.317943 0.301306 0.288332 0.373421 0.240358 0.240873 0.243370 0.241238 0.243328 0.279225 0.242155 0.234736 0.272302 0.275202
chargesum: 0.00000
title: Mulliken charges with hydrogens summed into heavy atoms:
elementType: O O O N N N N C C C C C C C C C C C C C C C C C C
charge: -0.271433 -0.235138 -0.196489 -0.058073 0.022856 -0.005019 0.001971 0.272546 0.354315 0.301057 0.011805 -0.285940 -0.085672 -0.065362 -0.100783 0.254509 0.016187 0.007174 0.124573 0.023604 0.146470 -0.052562 -0.071240 -0.030390 -0.078965
polarizability: 3.86819388e+02 9.82896421e+00 4.15324080e+02 -6.94935602e+00 2.64718182e-01 1.12960536e+02
1716.lowfreq: -9.4819 -5.9687 -2.0534 -0.0005 0.0003 0.0004 8.8329 30.7974 33.4514
frequency: 4.5769 30.7522 33.4494 39.0205 55.1381 59.2445 88.0969 113.8225 131.8169 158.9356 164.6176 175.5707 183.2098 208.8787 230.2420 244.0070 254.9165 284.9459 305.5864 310.6685 329.3498 375.2317 398.2598 405.6058 462.0498 469.9011 501.8142 506.2912 571.9019 572.0774 587.6334 602.6832 627.8377 647.8209 649.9356 660.7254 668.2594 690.5317 702.9352 722.8735 743.8898 759.5106 787.1806 793.1034 796.0406 827.0162 844.2851 849.9275 852.1153 852.3154 888.8156 890.2101 902.8513 932.6745 978.0924 978.9530 986.7539 996.1305 1015.7865 1035.2227 1043.2026 1043.4130 1049.6115 1076.4779 1105.0692 1132.2389 1157.0620 1161.6530 1172.2861 1178.8061 1217.6407 1261.0365 1292.3988 1322.2469 1329.6087 1330.0655 1336.3684 1349.6264 1395.9287 1410.5360 1411.0624 1414.5024 1438.5600 1452.5644 1466.6120 1471.4800 1474.7834 1479.3964 1487.7652 1493.4783 1510.5996 1536.6101 1555.8130 1574.0762 1606.2489 1615.6407 1640.1539 2975.6118 2980.0382 3048.9637 3061.3875 3087.0486 3095.3166 3138.5768 3153.7559 3167.2686 3176.2877 3198.8430 3201.6802 3203.7136 3345.0725
redmass: 1.0603 5.4518 5.7217 4.9260 5.2860 5.2090 5.6351 6.5901 4.5128 1.0633 4.1692 4.9457 5.5707 5.4865 5.2171 4.1768 6.0454 4.3723 6.0033 5.4878 6.6151 4.8381 4.9815 3.8285 7.0614 5.7344 3.7313 5.8566 7.2230 6.9857 6.3456 5.8285 5.6874 5.7268 4.5286 4.6227 4.8322 7.5488 6.6385 3.8196 6.8318 7.5883 1.5022 1.4920 3.6022 9.4886 3.6712 3.0059 1.3170 1.3623 5.8118 6.8420 1.4842 1.8787 1.5790 1.7091 5.6271 1.3873 1.3609 2.2209 1.4574 1.8392 2.6110 3.2932 3.5310 1.9811 1.4288 1.5178 1.1839 2.8667 2.3814 2.1052 2.6586 3.8395 4.1982 4.7953 2.3502 3.6474 8.6430 1.3863 1.6108 2.1312 2.1351 2.8648 1.1702 2.0665 1.0460 1.1275 1.5393 3.7866 4.0397 5.1694 7.6822 6.8618 6.4891 6.6996 8.4652 1.0389 1.0381 1.0988 1.0964 1.0996 1.0966 1.0865 1.0907 1.0957 1.0988 1.0915 1.0969 1.0967 1.0747
irintensity: 0.0297 0.8816 1.1274 2.6257 3.3472 3.5285 3.7260 0.7571 0.9870 0.6157 0.8162 0.7471 0.8678 0.7099 4.1997 0.8009 1.3373 2.3539 1.9498 0.5626 14.0695 3.7802 5.2793 2.3282 3.4378 4.6196 0.8657 1.1557 7.2508 4.8243 14.6507 22.3819 5.2526 7.8212 3.3207 5.7059 4.1381 6.1758 3.3771 29.3609 4.4182 9.1598 37.6600 89.5792 18.0782 6.7468 5.4422 5.8565 18.1320 22.0256 2.5832 24.1522 19.5331 3.7952 20.7276 21.3586 55.6028 3.3684 0.3709 2.2611 1.9660 14.2274 13.3051 3.8042 7.0338 4.5129 15.4110 1.8611 23.9449 30.4673 2.0208 11.7404 77.2858 34.5193 20.5405 3.9223 208.8528 40.6746 45.3641 11.0721 8.5864 5.0184 40.7437 38.5540 14.1281 2.9606 16.1822 16.8524 66.9299 288.1421 120.9444 116.6007 139.9021 107.0283 13.2427 6.9155 508.9809 37.0815 11.8966 18.0019 9.8807 19.5094 15.5316 4.2072 8.7296 8.8082 21.3590 2.8274 5.4408 1.3057 112.0531
temp: 298.150 k
press: 1.00000 atm
elementType: 8 8 8 7 7 7 7 6 6 6 6 6 6 6 6 6 6 6 6 6 6 6 6 6 6 1 1 1 1 1 1 1 1 1 1 1 1 1 1
symmnumber: 1
zpe: 752273.3 jmol-1
zpe.correction: 0.286526 hartree
zpe.thermalcorrener: 0.307993 hartree
zpe.thermalcorrenthalpy: 0.308937 hartree
zpe.thermalcorrgfe: 0.232318 hartree
zpe.sumelectzpe: -1137.168710 hartree
zpe.sumelectthermal: -1137.147243 hartree
zpe.sumelectthermalent: -1137.146299 hartree
zpe.sumelectthermalfe: -1137.222918 hartree
dipole: -3.4750 -4.9285 2.7464
dipole: 6.6263
quadrupole: -120.2612 -155.2850 -147.7825
quadrupole: -10.3280 5.7939 12.7923
quadrupole: 20.8484 -14.1755 -6.6729 -10.3280 5.7939 12.7923
hfenergy: -1137.4552362 hartree
pointgroup: C01[X(C18H14N4O3)]
dipole: -0.2384991 2.3523189 -1.0982694 debye
polarizability: 384.4654985|6.8180409|417.0199333|14.4371272|-4.183347|113.6185726 unknown
InChI: InChI=1S/C18H14N4O3/c1-10-8-19-24-17(10)21-14-7-15(22-18-11(2)9-20-25-18)16(23)13-6-4-3-5-12(13)14/h3-9,22H,1-2H3
charge 0 multiplicity 1
39 atoms
O  -2.886238 0.467912 -0.014477
O  1.191224 3.299275 -0.114252
O  0.385815 -4.256481 1.02831
N  -1.126603 2.092885 0.025568
N  1.275779 -2.226656 0.284799
N  -4.376404 0.451536 -0.028796
N  -0.698332 -5.181553 0.735035
C  2.499056 -0.163456 0.118133
C  2.51484 1.261882 0.011172
C  -0.025143 1.242653 0.044803
C  1.205041 -0.895156 0.165929
C  1.253168 2.021149 -0.032845
C  -0.033171 -0.140833 0.141545
C  3.730436 -0.863404 0.16991
C  3.749806 1.959962 -0.048118
C  -2.472695 1.80251 0.024602
C  4.951534 -0.162399 0.116693
C  4.964144 1.252832 0.00319
C  -3.577771 2.660441 0.038276
C  0.241996 -3.108067 0.193626
C  -0.87586 -3.304313 -0.649127
C  -3.573372 4.165867 0.082259
C  -4.696871 1.767047 0.002582
C  -1.388506 -2.437305 -1.767291
C  -1.385774 -4.587955 -0.270787
H  -0.977583 -0.676735 0.241816
H  3.698307 -1.952844 0.257634
H  3.725323 3.050969 -0.131513
H  -0.84101 3.087003 -0.022452
H  5.896612 -0.713979 0.16378
H  5.916607 1.790989 -0.041521
H  -4.603676 4.557323 0.102622
H  -3.073797 4.605384 -0.802247
H  -3.058337 4.550529 0.982958
H  -5.754785 2.033898 0.000963
H  -0.591312 -1.790442 -2.173311
H  -1.775522 -3.060277 -2.592559
H  -2.21161 -1.775325 -1.437152
H  -2.250216 -5.107365 -0.686857
