program: Gaussian 09
title: 000133732
version: EM64L-G09RevD.01
frameworkgroup: C1[X(C15H12N2O3)]
method: RPBEPBE
basis: SDD
operation: Freq
keyword: #p
keyword: freq=noraman
keyword: PBEPBE/SDD
title: #p freq=noraman PBEPBE/SDD
converged: YES YES NO NO
title: Mulliken charges:
elementType: O O O N N C C C C C C C C C C C C C C C H H H H H H H H H H H H
charge: -0.252007 -0.138123 -0.172695 -0.459309 -0.046256 0.269277 0.409188 0.279241 0.270082 0.009032 -0.486412 -0.338378 -0.207482 0.163546 -0.374972 0.046890 -0.811323 -0.264382 -0.233275 -0.766046 0.334359 0.328237 0.190703 0.295353 0.257720 0.234316 0.240648 0.237994 0.246588 0.237890 0.238054 0.261543
chargesum: 0.00000
title: Mulliken charges with hydrogens summed into heavy atoms:
elementType: O O O N N C C C C C C C C C C C C C C C
charge: -0.252007 -0.138123 -0.172695 -0.124950 -0.046256 0.269277 0.409188 0.279241 0.270082 0.009032 -0.158175 -0.147675 -0.207482 0.163546 -0.079619 0.046890 -0.078639 -0.026388 0.013313 -0.028559
polarizability: 3.38456285e+02 -1.50949375e+01 2.35746349e+02 4.21651232e-01 -2.62069476e-01 8.05038833e+01
1716.lowfreq: -8.7872 0.0002 0.0004 0.0006 2.9964 4.4227 17.8517 32.5258 38.1040
frequency: 17.0420 32.4743 37.9896 51.1835 78.1754 95.1927 133.8239 144.4286 176.4592 182.7342 199.3494 204.8557 246.3864 279.6372 307.1422 334.7471 347.4715 387.1304 391.5932 444.7368 448.3648 465.6982 498.4021 543.2734 555.4554 593.6871 600.4032 620.9808 637.2610 668.6287 684.3605 696.7203 700.0134 717.0857 771.2834 774.7432 800.5989 833.0577 844.1136 880.5714 921.6183 922.2335 949.8291 971.1989 995.7217 1010.3295 1036.3281 1044.6401 1050.2596 1069.2871 1095.8661 1129.3845 1171.2366 1186.9923 1214.4331 1247.4619 1259.2633 1295.1733 1317.1277 1364.5098 1385.4403 1400.2301 1405.6720 1432.0555 1436.9719 1446.5340 1460.8548 1466.0420 1482.1553 1485.8563 1490.6807 1517.6789 1541.6915 1567.9316 1578.6641 1612.6777 1617.3304 1627.7897 2963.1226 2991.1799 3032.6651 3073.3713 3089.3331 3108.1714 3109.9240 3143.7360 3154.8595 3172.2618 3194.8832 3549.1101
redmass: 4.7459 3.6901 1.2573 4.4088 4.9581 4.1976 1.2595 2.7145 3.6731 4.3184 6.1243 4.7176 2.8937 3.8955 6.9882 4.3924 14.6511 3.8129 6.3782 6.2753 4.1340 5.5910 2.9953 2.1206 6.1814 6.4560 4.2208 5.2352 3.8213 5.9719 5.0523 6.2232 6.9315 2.7027 1.7640 5.8955 7.0566 1.9954 5.8754 1.6355 2.2541 2.1015 6.7349 1.4139 1.6493 1.3796 1.3912 2.7433 1.5225 2.6541 2.5632 2.0426 4.4055 1.1402 2.5218 2.3199 2.9039 2.0475 3.5664 2.6058 9.5855 1.2516 1.2701 2.4111 2.2425 2.1023 1.9489 1.0467 1.0469 1.6070 1.8349 2.1493 6.5987 6.8453 7.4428 7.2086 7.1825 5.0473 1.0397 1.0373 1.0989 1.0985 1.0947 1.0877 1.0985 1.0879 1.0932 1.1006 1.0917 1.0744
irintensity: 0.7875 0.4808 0.0331 0.0264 0.0171 1.0279 1.9194 3.5221 0.3324 0.8373 0.2121 1.4156 2.0134 1.8941 5.0850 0.0523 3.5866 0.5140 0.5517 1.4433 12.4337 0.1722 0.4248 31.5575 2.6465 5.7453 5.8933 2.3416 9.7112 4.8586 6.1404 3.5194 6.3854 40.8385 65.0675 13.4263 2.1616 4.8905 3.5316 3.7810 14.4811 21.3565 21.0065 3.9269 10.4306 1.3602 4.1754 2.2784 0.9358 12.7499 6.3685 11.4305 10.1341 0.2948 37.8158 57.5478 6.3332 68.9532 2.9040 10.2795 6.3566 16.3452 13.7632 16.4247 4.5726 7.5571 157.9407 29.8399 4.1481 1.7437 200.2157 7.6615 425.5689 34.6242 119.9953 215.6801 9.3336 187.0848 34.7041 20.5621 20.3115 14.2018 14.2197 24.4816 6.3454 6.6077 3.4637 21.9965 7.1578 36.7407
temp: 298.150 k
press: 1.00000 atm
elementType: 8 8 8 7 7 6 6 6 6 6 6 6 6 6 6 6 6 6 6 6 1 1 1 1 1 1 1 1 1 1 1 1
symmnumber: 1
zpe: 623368.2 jmol-1
zpe.correction: 0.237428 hartree
zpe.thermalcorrener: 0.255267 hartree
zpe.thermalcorrenthalpy: 0.256211 hartree
zpe.thermalcorrgfe: 0.189300 hartree
zpe.sumelectzpe: -912.522475 hartree
zpe.sumelectthermal: -912.504637 hartree
zpe.sumelectthermalent: -912.503693 hartree
zpe.sumelectthermalfe: -912.570604 hartree
dipole: -4.4157 11.6249 0.0665
dipole: 12.4355
quadrupole: -106.4595 -126.7087 -117.6678
quadrupole: 8.9045 -0.7121 -0.1053
quadrupole: 10.4858 -9.7634 -0.7224 8.9045 -0.7121 -0.1053
hfenergy: -912.7599034 hartree
pointgroup: C01 [X(C15H12N2O3)]
dipole: 1.6933816 -4.584244 -0.2316232 debye
polarizability: 338.1049504|-15.8662761|235.585429|-4.4809648|8.4669498|81.016138 unknown
InChI: InChI=1S/C15H12N2O3/c1-8-9(2)17-20-15(8)16-12-7-13(18)14(19)11-6-4-3-5-10(11)12/h3-7,16H,1-2H3
charge 0 multiplicity 1
32 atoms
O  2.4951 1.30681 -0.035807
O  -4.075971 1.911015 0.171818
O  -1.72682 3.482598 0.184976
N  0.944557 -0.547065 -0.064881
N  3.972949 1.493691 -0.043871
C  -1.49574 -0.736915 -0.053047
C  -0.282459 0.129914 -0.018099
C  -2.78558 -0.123394 0.013301
C  2.244973 -0.060872 -0.060335
C  3.439672 -0.78309 -0.083209
C  -0.375817 1.512052 0.057224
C  -1.438527 -2.15334 -0.151336
C  -2.940245 1.365283 0.106706
C  4.464978 0.228795 -0.072324
C  -3.958953 -0.914266 -0.011983
C  -1.648835 2.215246 0.118601
C  3.608966 -2.279351 -0.115506
C  -2.613649 -2.935032 -0.176284
C  -3.88282 -2.317291 -0.105047
C  5.955592 0.032551 -0.086348
H  0.903364 -1.566384 -0.097191
H  0.520085 2.134941 0.076279
H  -0.487415 -2.695614 -0.218089
H  -4.92122 -0.394494 0.042336
H  4.675739 -2.550195 -0.050361
H  3.100286 -2.776343 0.733968
H  3.221133 -2.725549 -1.05251
H  -2.535891 -4.02465 -0.252747
H  -4.794111 -2.923086 -0.124078
H  6.275588 -0.517117 -0.989929
H  6.288819 -0.542341 0.796686
H  6.465351 1.009292 -0.075814
