program: Gaussian 09
title: 000133721
version: EM64L-G09RevD.01
frameworkgroup: C1[X(C9H8BrNO3)]
method: RPBEPBE
basis: SDD
operation: Freq
keyword: #p
keyword: freq=noraman
keyword: PBEPBE/SDD
title: #p freq=noraman PBEPBE/SDD
converged: YES YES NO NO
title: Mulliken charges:
elementType: Br O O O N C C C C C C C C C H H H H H H H H
charge: 0.028263 -0.236172 -0.396473 -0.242682 -0.390274 0.378397 0.152905 -0.387239 -0.374424 -0.367366 -0.198739 -0.226232 -0.219633 0.171637 0.282515 0.286909 0.356644 0.258868 0.253906 0.237555 0.239595 0.392040
chargesum: 0.00000
title: Mulliken charges with hydrogens summed into heavy atoms:
elementType: Br O O O N C C C C C C C C C
charge: 0.028263 -0.236172 -0.004433 -0.242682 -0.033630 0.378397 0.152905 0.182185 -0.374424 -0.108499 0.055166 0.011324 0.019962 0.171637
polarizability: 1.54178511e+02 7.14494911e+00 1.51901002e+02 -1.04254716e+01 -5.72421203e+00 7.24931481e+01
1716.lowfreq: -2.1683 -0.0004 0.0002 0.0003 3.4333 6.7065 17.8016 50.7820 57.3593
frequency: 17.7669 50.7807 57.3584 61.6465 109.0919 125.2839 172.6005 191.6525 240.0617 260.7710 301.1925 340.1331 386.9022 441.4221 471.7541 493.4498 553.1969 589.1290 612.3833 634.7511 638.9356 679.1298 698.5797 746.0186 772.9842 812.0989 876.5650 916.6587 956.8228 988.8391 991.9361 1007.1589 1030.9200 1048.4885 1097.0189 1124.9328 1173.0128 1176.4482 1196.3471 1244.3536 1261.0156 1277.1989 1364.0623 1372.9539 1414.1295 1449.7425 1460.1928 1482.3606 1565.3687 1595.6074 1598.5470 1664.0099 2992.8389 3032.0870 3133.7894 3145.3802 3162.0318 3175.9315 3513.8496 3521.7393
redmass: 8.8008 9.9095 5.4227 6.4072 5.0679 6.5782 4.6212 4.8136 6.2600 9.7201 7.8970 6.4357 5.5581 3.9840 4.1713 1.8330 4.1953 5.1288 1.1541 4.5540 1.4957 6.7607 5.6939 2.3806 1.6983 6.4134 1.3734 3.7889 1.3850 2.0662 1.3483 6.9703 3.6483 2.4659 2.4424 1.7199 2.1358 1.2348 1.0902 1.5984 1.4278 1.8553 7.6114 2.4913 2.1047 1.9744 1.2283 2.2115 6.0795 7.2261 8.5910 8.0900 1.0602 1.0995 1.0865 1.0900 1.0949 1.1000 1.0782 1.0644
irintensity: 0.0748 1.1693 4.2793 2.4040 0.8895 2.0741 5.9382 5.1224 0.6546 0.5644 5.8726 5.1693 8.5316 17.6664 40.0616 34.9413 46.9670 4.2784 9.7309 10.5530 215.4336 18.6633 7.9799 34.9472 46.1261 6.1185 0.3864 23.3292 1.7124 1.2770 0.3996 56.8111 48.5843 147.7589 131.3970 5.5785 1.4869 1.4375 0.0677 13.0321 3.2109 1.5960 11.0438 218.4634 22.8506 53.5347 17.2167 292.7081 14.8211 25.1292 227.0308 147.2328 27.0464 4.4128 1.2843 6.8181 13.2340 14.4857 81.2340 34.6517
temp: 298.150 k
press: 1.00000 atm
elementType: 35 8 8 8 7 6 6 6 6 6 6 6 6 6 1 1 1 1 1 1 1 1
symmnumber: 1
zpe: 409550.0 jmol-1
zpe.correction: 0.155989 hartree
zpe.thermalcorrener: 0.169409 hartree
zpe.thermalcorrenthalpy: 0.170353 hartree
zpe.thermalcorrgfe: 0.112624 hartree
zpe.sumelectzpe: -640.642880 hartree
zpe.sumelectthermal: -640.629461 hartree
zpe.sumelectthermalent: -640.628517 hartree
zpe.sumelectthermalfe: -640.686246 hartree
dipole: -2.0163 3.1677 -1.6373
dipole: 4.0964
quadrupole: -65.8709 -85.6720 -97.8369
quadrupole: 7.1667 -2.0520 6.2891
quadrupole: 17.2557 -2.5454 -14.7103 7.1667 -2.0520 6.2891
hfenergy: -640.7988696 hartree
pointgroup: C01 [X(C9H8Br1N1O3)]
dipole: 0.3110154 0.7441939 1.3953172 debye
dipolederiv: -0.0386309 0.1233296 0.0537477 0.0844315 -0.4912633 -0.2830298 0.027839 -0.263749 -0.1544284 -0.7594173 -0.0498735 0.1539911 -0.0158553 -0.3255312 -0.0557254 -0.1694021 -0.0299532 -0.9090212 -1.4254915 -0.091509 0.1857996 -0.0728755 -0.4184171 0.0348902 0.1198536 0.0296037 -0.2773814 -0.8065896 -0.0617118 -0.0093214 -0.0173585 -0.3098312 -0.0650325 0.1950231 -0.0407683 -0.8925964 -1.0726708 -0.121068 -0.324103 -0.1153792 -0.4236775 -0.0870656 -0.4934316 -0.0799927 -0.6303388 -0.3037909 0.0056409 0.0955785 -0.0202935 -0.2462726 -0.1515786 0.056669 -0.1574246 -0.1452915 1.6243772 0.2252225 0.1722514 0.1196665 0.2158022 0.1874322 0.486988 0.087162 1.2510339 0.430624 0.0165127 -0.0746706 -0.0615942 0.2798138 -0.0730279 -0.3740205 -0.0963361 -0.1847295 0.0798568 -0.2511595 -0.1969331 -0.0407384 0.8830962 0.5335464 -0.0272362 0.5799628 0.1847258 -0.0389018 0.0021808 -0.0497155 0.0273337 0.0052189 0.0513877 -0.1276384 0.0573666 -0.0704774 -0.0763146 0.1834571 0.0813945 0.1548697 -0.2250641 -0.1272345 0.0679484 -0.1211063 -0.1698039 -0.1246742 -0.054516 -0.0439041 -0.0387539 -0.0063719 0.0893125 -0.0266994 0.0983976 -0.0769146 0.0775468 0.0555344 -0.050576 -0.0014042 0.0380164 0.0990249 -0.0718992 0.0728688 -0.0736799 1.7828667 0.1586286 -0.0575662 0.1189976 0.2265027 0.1081169 -0.079937 0.0956733 1.1946817 -0.0146014 -0.0344709 -0.0282227 -0.0570075 0.0118403 0.0575301 0.0766616 0.0671123 0.0757916 -0.0166085 0.0117305 -0.0334898 0.0751404 0.0073683 -0.0338549 0.07139 -0.0307372 0.1083683 0.2722905 0.0159027 0.0270725 0.0162335 0.2877148 -0.0123942 0.1884068 0.0133303 0.2059555 0.0297501 -0.0928004 -0.0037141 -0.099097 0.0054096 -0.0413587 0.0108036 -0.0471986 0.109812 0.0301583 -0.0737742 0.0033146 -0.0912711 0.023363 -0.0407235 -0.0039205 -0.0412159 0.1379104 0.0696541 0.0279292 0.045293 0.0423821 -0.023334 -0.113969 0.0603494 -0.1083002 0.0858401 -0.0764949 0.0083721 0.0840019 0.0042193 0.0894174 -0.0386994 0.0840097 -0.0462109 0.1090395 0.3570618 -0.0035576 -0.0302284 -0.0116459 0.3961993 -0.0375466 -0.0717573 -0.0384844 0.1215044 unknown
polarizability: 157.7107371|5.8063399|117.2810198|-14.4937615|36.3394799|103.5809043 unknown
InChI: InChI=1S/C9H8BrNO3/c10-7-4-2-1-3-6(7)9(14)11-5-8(12)13/h1-4,11-12H,5H2
charge 0 multiplicity 1
22 atoms
Br -1.662901 -2.520917 -1.533997
O  0.461401 -0.05745 -2.135915
O  4.839248 0.701293 0.430954
O  3.102962 0.73209 1.979978
N  1.221037 0.35392 0.014797
C  -1.181771 0.131315 -0.321073
C  0.213561 0.11619 -0.904899
C  2.615288 0.409878 -0.41365
C  -2.135492 -0.891484 -0.551912
C  -1.586721 1.258442 0.445754
C  -3.448207 -0.798873 -0.043197
C  -2.897497 1.367141 0.954891
C  -3.830597 0.335972 0.707397
C  3.500564 0.628896 0.797663
H  2.781894 1.222441 -1.146906
H  2.917203 -0.522181 -0.930534
H  1.034596 0.410302 1.020838
H  -0.866361 2.066655 0.615568
H  -4.161737 -1.606872 -0.228533
H  -3.188257 2.249772 1.533582
H  -4.852667 0.406196 1.094117
H  5.406352 0.839473 1.237279
