program: Gaussian 09
title: 000133703
version: EM64L-G09RevD.01
frameworkgroup: C1[X(C8H7N4)]
method: RPBEPBE
basis: SDD
operation: Freq
keyword: #p
keyword: freq=noraman
keyword: PBEPBE/SDD
title: #p freq=noraman PBEPBE/SDD
converged: YES YES NO NO
title: Mulliken charges:
elementType: N N N N C C C C C C C C H H H H H H H
charge: -0.391422 -0.319323 0.101974 0.117609 0.316163 0.242226 -0.521746 -0.275488 -0.348137 0.508425 -0.379781 -0.173889 0.273210 0.268666 0.283485 0.347055 0.258519 0.284918 0.407538
chargesum: 1.00000
title: Mulliken charges with hydrogens summed into heavy atoms:
elementType: N N N N C C C C C C C C
charge: -0.044368 0.088215 0.101974 0.117609 0.316163 0.242226 -0.248536 -0.006823 -0.064652 0.508425 -0.121261 0.111029
polarizability: 2.52591046e+02 5.22796316e+00 1.18606562e+02 4.19549419e+00 1.03937974e+00 4.84189205e+01
1716.lowfreq: -4.0794 0.0002 0.0005 0.0006 6.4973 9.0954 34.5824 86.1010 149.0002
frequency: 34.5430 86.1007 149.0002 220.2038 231.1276 307.6899 322.0469 390.7757 414.2086 436.7753 513.7176 560.4899 581.6828 595.2537 627.3748 630.8149 737.5250 746.2723 779.3127 801.5219 814.5961 878.4171 884.0088 902.0457 934.6770 945.0459 1049.9925 1070.4370 1102.7146 1119.7502 1149.2729 1217.5930 1255.0182 1296.2873 1330.4386 1361.1616 1411.3989 1427.7214 1476.6971 1483.7980 1502.8141 1578.2396 1619.9434 2031.3784 3147.7248 3152.2436 3172.9305 3229.7090 3253.2155 3457.0316 3585.5166
redmass: 5.4992 7.8755 5.8132 4.9979 3.8635 4.1649 7.3981 8.5754 2.8142 3.6490 1.6383 4.0794 4.7665 4.1187 1.3654 2.9449 2.8418 4.5548 1.2732 2.2437 3.0034 2.6773 1.9476 1.4558 3.5215 1.3455 6.2692 1.8013 1.5072 2.0405 1.4948 2.4224 1.4047 2.2227 1.8175 3.0035 1.5909 2.4419 4.1790 3.4535 3.4143 6.0903 6.4377 11.7873 1.0935 1.0893 1.0982 1.0927 1.1077 1.0789 1.0819
irintensity: 1.4413 4.0055 19.7533 91.0745 4.1504 7.5860 21.7033 1.1560 14.4986 3.7387 93.8985 21.6417 2.7878 4.5517 72.3151 50.2441 1.2881 10.8879 118.2645 6.7723 26.4516 16.6762 22.8202 13.8190 8.1955 1.3032 18.9224 22.6244 41.6641 29.3252 28.4818 8.5169 6.7493 5.4662 8.6758 29.6666 6.1476 69.4087 46.7780 0.4726 40.4293 2.0672 50.4709 627.9314 0.0808 0.0464 0.3712 1.2817 0.8429 147.1381 176.3901
temp: 298.150 k
press: 1.00000 atm
elementType: 7 7 7 7 6 6 6 6 6 6 6 6 1 1 1 1 1 1 1
symmnumber: 1
zpe: 370891.7 jmol-1
zpe.correction: 0.141265 hartree
zpe.thermalcorrener: 0.151043 hartree
zpe.thermalcorrenthalpy: 0.151987 hartree
zpe.thermalcorrgfe: 0.105313 hartree
zpe.sumelectzpe: -526.900239 hartree
zpe.sumelectthermal: -526.890461 hartree
zpe.sumelectthermalent: -526.889517 hartree
zpe.sumelectthermalfe: -526.936191 hartree
dipole: -2.7982 2.2469 0.5532
dipole: 3.6310
quadrupole: -12.5413 -50.4389 -69.7565
quadrupole: -2.6113 -6.2579 -0.7733
quadrupole: 31.7043 -6.1933 -25.5110 -2.6113 -6.2579 -0.7733
hfenergy: -527.0415041 hartree
pointgroup: C01 [X(C8H7N4)]
dipole: -1.0618051 0.9338853 0.2029253 debye
dipolederiv: -0.6786575 0.0234501 -0.0132832 -0.4818088 -0.2657159 0.0144715 0.090103 -0.0018706 -0.2347214 0.8050082 -0.1346641 -0.0044542 -0.2891433 -0.2376993 -0.0213768 0.2382491 -0.0341523 -0.2205374 0.461589 0.2334136 0.3280836 2.2310733 0.3547161 0.4333214 0.5740393 0.0860813 0.3911124 -0.799003 0.0108887 -0.1534949 -2.059614 0.0142001 -0.3047927 -0.8259154 0.0277167 -0.0294793 -0.3777695 -0.1672837 -0.0208497 -0.1826812 0.1069732 0.0540143 0.1453295 0.0070666 0.060017 0.4381941 -0.0366146 -0.0200653 0.2529874 -0.2645711 0.004056 -0.0697627 0.0344836 0.0396843 0.4293961 0.0313883 0.0121785 -0.4170701 -0.0583316 -0.0668263 -0.0693703 -0.0587079 -0.1294863 0.1931389 -0.0614349 -0.0201063 -0.0104522 0.1906576 -0.0179424 -0.1287956 -0.020725 -0.1046479 -0.3086976 0.0971976 0.0046151 -0.1162388 0.0091182 -0.0408807 0.0277255 -0.0188201 -0.2157008 -0.2565389 0.049622 -0.082558 0.7022765 0.1181398 -0.0745956 0.262711 -0.044912 0.0174279 -0.2482662 0.0505144 -0.0248235 -0.06664 -0.001142 0.0022716 -0.0861141 -0.0104671 -0.1634943 0.4219984 -0.0299115 -0.0024246 0.4089307 0.2488768 -0.0540792 -0.1145456 -0.0235803 -0.091321 0.0154141 -0.0482189 0.0118982 -0.0294561 0.0406009 0.0157847 -0.0494457 0.00916 0.1600548 0.0660965 -0.0637646 0.0101283 -0.0280261 0.0305864 0.0146852 0.0560837 0.0156751 0.1766433 0.1034374 -0.0229494 0.0086707 -0.0052891 0.0365586 0.0136922 0.0129325 0.015232 0.1992406 0.3708219 0.0407561 0.0085989 0.1097256 0.1874131 0.0151305 -0.0104356 0.010244 0.3529146 0.0342091 0.0845109 0.008679 0.0305169 0.0399482 0.0143897 0.0346789 0.0090323 0.1866341 0.0573703 0.0224275 0.0083227 0.004067 0.1151315 0.0077337 0.0171437 0.0025139 0.2111181 0.2722587 -0.0793275 -0.0591155 -0.0531578 0.3345393 -0.0090571 -0.1046111 -0.00397 0.3945414 unknown
polarizability: 251.8906789|-2.454826|118.2712877|13.9377644|3.3788209|49.4545619 unknown
InChI: InChI=1S/C8H7N4/c9-12-11-7-1-2-8-6(5-7)3-4-10-8/h1-5,10-11H
charge 1 multiplicity 1
19 atoms
N  3.018116 0.258591 -0.124956
N  -2.531395 0.659651 0.282929
N  -3.327907 -0.143357 -0.394072
N  -3.916234 -1.036884 -0.881078
C  0.956902 -0.687327 0.104844
C  1.667746 0.569145 -0.054934
C  -0.449622 -0.67139 0.211875
C  1.0070 1.817247 -0.112033
C  1.94652 -1.741716 0.126884
C  -1.086438 0.589359 0.156032
C  -0.395132 1.824272 -0.02158
C  3.189558 -1.131252 -0.017096
H  -1.013328 -1.599814 0.356739
H  1.554606 2.757553 -0.225525
H  1.769301 -2.809386 0.235083
H  3.776539 0.931804 -0.236937
H  -0.944719 2.769304 -0.083318
H  4.182398 -1.575502 -0.048775
H  -3.002511 1.460999 0.727119
