program: Gaussian 09
title: 000133680
version: EM64L-G09RevD.01
frameworkgroup: C1[X(C14H24N4O2)]
method: RPBEPBE
basis: SDD
operation: Freq
keyword: #p
keyword: freq=noraman
keyword: PBEPBE/SDD
title: #p freq=noraman PBEPBE/SDD
converged: YES YES NO NO
title: Mulliken charges:
elementType: O O N N N N C C C C C C C C C C C C C C H H H H H H H H H H H H H H H H H H H H H H H H
charge: -0.245119 -0.232138 -0.134207 -0.076915 -0.301126 -0.297600 0.085140 -0.396476 -0.396850 0.133813 0.175034 -0.390638 -0.343893 -0.321162 -0.407331 -0.413548 -0.101310 -0.367756 -0.721654 -0.718327 0.233965 0.226419 0.225901 0.234467 0.260583 0.228427 0.196793 0.209665 0.226648 0.200271 0.190093 0.214921 0.216157 0.192460 0.273557 0.264188 0.254965 0.228008 0.229467 0.218986 0.222147 0.230783 0.220042 0.273147
chargesum: 0.00000
title: Mulliken charges with hydrogens summed into heavy atoms:
elementType: O O N N N N C C C C C C C C C C C C C C
charge: -0.245119 -0.232138 -0.134207 -0.076915 -0.027569 -0.024452 0.085140 0.063909 0.063518 0.133813 0.175034 0.098372 0.062565 0.105758 -0.002317 -0.004931 0.162878 -0.112791 -0.045193 -0.045355
polarizability: 2.22462482e+02 1.07091419e+01 1.74637714e+02 3.20617583e+00 -9.67861491e+00 1.56802685e+02
1716.lowfreq: -29.4623 -15.2949 -10.7861 -0.0002 0.0005 0.0006 1.9834 10.1284 27.2233
frequency: -29.0823 -8.8345 27.2071 33.8460 58.2762 80.9508 90.3307 95.5311 122.2924 152.1682 176.0371 184.2353 201.9687 216.0666 244.7378 277.7489 292.7705 303.2237 322.6370 341.1132 355.4009 370.8040 379.3708 386.9887 401.1602 427.4791 448.6528 455.7736 463.1858 482.3882 535.8929 576.4332 584.9773 641.9351 679.5685 687.8613 728.4506 743.7725 751.3785 782.0144 782.5173 827.9788 841.1420 855.4284 876.0689 914.1995 916.6982 940.2897 945.6710 967.7835 993.1687 1035.4373 1041.5402 1054.0372 1057.6090 1066.6924 1071.7934 1077.0381 1079.9542 1093.9273 1115.7058 1118.1376 1144.9678 1148.8625 1166.0739 1171.2082 1191.6560 1204.2581 1243.0121 1249.1868 1261.5833 1269.4794 1278.6854 1290.7967 1298.1289 1315.8960 1320.8468 1331.6150 1344.3454 1349.4895 1370.5490 1372.4839 1382.8128 1394.8766 1399.2511 1415.6608 1439.4362 1443.1318 1444.4138 1445.6840 1453.6245 1455.6159 1458.2812 1466.4847 1474.4869 1480.3604 1481.0805 1483.3832 1484.2980 1554.6621 1598.4803 1623.4306 2869.7142 2876.0045 2897.4737 2911.9641 2977.6117 2980.1449 2985.8627 3000.4919 3005.6413 3041.4040 3043.9397 3048.2049 3055.3522 3059.1822 3066.7151 3074.2945 3075.8769 3081.8082 3085.5918 3094.9799 3150.4485 3181.3289 3422.6672 3471.6804
redmass: 4.0368 3.7749 4.9893 3.8301 5.3045 2.4885 2.3162 3.5576 4.1036 3.3362 4.1213 1.7353 1.3740 2.4390 1.8200 1.5879 2.1883 1.7213 2.3725 2.4709 3.2392 2.6174 3.1974 4.8394 5.7590 3.0236 3.5638 4.0979 3.2501 2.3428 1.4918 5.5706 3.8301 4.5030 1.8192 3.0129 3.6177 3.3307 1.6703 2.4743 1.6181 1.7090 1.4627 2.7373 2.6738 1.9458 2.0094 3.8427 2.1753 1.3454 2.5328 2.4802 1.5974 1.7429 1.7916 2.5250 3.8683 2.8227 1.5902 2.4440 2.7322 2.3079 2.8695 2.1120 2.7195 2.9683 1.1581 2.5176 1.5548 2.0903 1.1520 1.3697 1.4677 1.2644 1.3367 1.2656 1.3625 1.2715 1.3902 1.3215 1.2808 1.5676 1.4356 1.2098 1.2141 2.5141 1.1509 1.2614 1.2457 1.0829 1.0825 1.1152 1.0744 1.1125 1.1671 1.0489 1.0506 1.0435 1.0418 8.7842 8.7551 6.1296 1.0712 1.0697 1.0685 1.0684 1.0357 1.0359 1.0659 1.0592 1.0591 1.0932 1.0886 1.0909 1.1015 1.1010 1.0923 1.0991 1.0988 1.1028 1.1025 1.0971 1.0890 1.0978 1.0768 1.0755
irintensity: 2.9322 0.0262 0.5185 2.8303 7.9641 0.6036 0.0907 1.1501 4.3889 0.3903 1.6906 0.9581 0.4748 6.2607 14.6145 0.2114 3.3447 13.7624 11.9262 33.4180 4.2358 7.7270 14.1977 6.6681 6.9112 31.0519 4.7205 7.7640 0.2411 1.3299 99.6587 11.9440 3.2027 6.9257 74.7350 13.0772 6.3434 19.6865 9.9417 6.6852 11.6133 35.9451 0.3734 0.2850 4.8857 2.1548 0.7275 0.5726 9.4393 3.7158 58.9470 20.6985 24.3710 2.5156 17.1400 11.3944 6.7757 2.9908 1.0698 23.7092 12.4520 7.7018 10.3382 100.3776 28.8588 44.5480 1.1036 33.4918 5.0862 133.5819 0.2608 6.2384 53.1783 4.7957 3.1234 33.2693 2.8304 7.0474 15.9894 2.0630 7.1080 124.0867 0.4414 12.7559 12.9471 58.9817 12.3029 2.3244 8.6912 0.1316 2.5991 49.3213 1.0458 16.3025 3.4739 6.1355 14.4124 16.2701 17.9255 203.1735 108.2616 220.9081 71.0212 84.6068 71.2048 124.5859 30.0701 18.2832 48.2599 4.5613 36.1876 28.8912 70.9501 32.7148 1.0570 6.3134 28.7148 34.5822 51.4126 7.6855 46.1247 3.5927 1.7647 4.6104 8.4120 0.4443
temp: 298.150 k
press: 1.00000 atm
elementType: 8 8 7 7 7 7 6 6 6 6 6 6 6 6 6 6 6 6 6 6 1 1 1 1 1 1 1 1 1 1 1 1 1 1 1 1 1 1 1 1 1 1 1 1
symmnumber: 1
zpe: 980569.5 jmol-1
zpe.correction: 0.373479 hartree
zpe.thermalcorrener: 0.392865 hartree
zpe.thermalcorrenthalpy: 0.393809 hartree
zpe.thermalcorrgfe: 0.325756 hartree
zpe.sumelectzpe: -915.726757 hartree
zpe.sumelectthermal: -915.707371 hartree
zpe.sumelectthermalent: -915.706427 hartree
zpe.sumelectthermalfe: -915.774480 hartree
dipole: -5.9780 -1.5740 -0.8201
dipole: 6.2359
quadrupole: -119.8530 -123.7648 -122.0087
quadrupole: -6.0348 8.4013 5.8886
quadrupole: 2.0225 -1.8893 -0.1332 -6.0348 8.4013 5.8886
hfenergy: -916.1002362 hartree
pointgroup: C01 [X(C14H24N4O2)]
dipole: -2.3998532 0.0519531 -0.5071783 debye
polarizability: 223.6406385|3.1844434|162.8114942|6.5844378|13.0917698|167.4507477 unknown
InChI: InChI=1S/C14H24N4O2/c1-3-14(4-2)12(19)5-8-17(13(14)20)11-16-18-9-6-15-7-10-18/h5,8,15-16H,3-4,6-7,9-11H2,1-2H3
charge 0 multiplicity 1
44 atoms
O  1.671017 -1.681009 -1.603915
O  3.337089 1.849238 1.309858
N  0.331327 0.129504 -1.029226
N  -2.784107 -0.325786 -0.297034
N  -1.76885 -1.136544 -0.891981
N  -5.234931 0.223348 1.070388
C  2.698112 -0.026076 -0.117376
C  3.049166 -1.103098 0.974601
C  3.949423 0.155934 -1.048099
C  1.547465 -0.592938 -0.969375
C  2.41884 1.319806 0.603956
C  -0.830563 -0.474293 -1.765208
C  -4.096279 -0.434494 -1.004978
C  -2.924917 -0.613112 1.160517
C  -5.112099 0.534201 -0.36804
C  -3.945394 0.360187 1.780286
C  0.138312 1.32175 -0.329831
C  1.10057 1.92114 0.447933
C  1.901868 -1.425629 1.955143
C  3.751459 1.162177 -2.200673
H  3.921342 -0.711326 1.529939
H  3.359479 -2.02119 0.442039
H  4.206351 -0.839081 -1.456029
H  4.777907 0.489636 -0.396444
H  -0.396933 -1.209403 -2.462131
H  -1.307349 0.350781 -2.329864
H  -4.497685 -1.47495 -0.942488
H  -3.940088 -0.177922 -2.068676
H  -1.932342 -0.491023 1.626218
H  -3.273299 -1.659081 1.331212
H  -4.761257 1.579014 -0.558757
H  -6.095105 0.40618 -0.856559
H  -4.086548 0.108986 2.846916
H  -3.523938 1.394057 1.717682
H  -1.988535 -2.124686 -1.073271
H  -0.865689 1.745094 -0.435813
H  0.891025 2.862112 0.963086
H  1.591801 -0.530686 2.52484
H  1.015583 -1.827145 1.429154
H  2.229209 -2.188677 2.684352
H  2.939046 0.846843 -2.881669
H  3.514955 2.172832 -1.821189
H  4.675142 1.239629 -2.802233
H  -6.005081 0.7251 1.528141
