program: Gaussian 09
title: 000133661
version: EM64L-G09RevD.01
frameworkgroup: C1[X(C23H26N)]
method: RPBEPBE
basis: SDD
operation: Freq
keyword: #p
keyword: freq=noraman
keyword: PBEPBE/SDD
title: #p freq=noraman PBEPBE/SDD
converged: YES YES NO NO
title: Mulliken charges:
elementType: N C C C C C C C C C C C C C C C C C C C C C C C H H H H H H H H H H H H H H H H H H H H H H H H H H
charge: -0.109830 -0.357297 -0.397213 -0.393000 -0.615744 0.401650 -0.554497 -0.544475 -0.555824 0.297795 0.004097 -0.024851 0.468673 -0.479567 0.482585 0.470038 -0.455916 -0.499023 -0.515909 -0.478866 -0.479636 -0.464465 -0.454966 -0.239213 0.269974 0.269804 0.228907 0.229243 0.238359 0.228988 0.221822 0.229924 0.274611 0.270083 0.261910 0.264945 0.269618 0.269583 0.275646 0.261812 0.270106 0.232364 0.217114 0.247507 0.236828 0.245861 0.246286 0.247022 0.250154 0.236984
chargesum: 1.00000
title: Mulliken charges with hydrogens summed into heavy atoms:
elementType: N C C C C C C C C C C C C C C C C C C C C C C C
charge: -0.109830 0.182482 0.060937 0.074348 -0.163998 0.401650 0.252106 0.259670 0.251741 0.297795 0.004097 -0.024851 0.468673 -0.247202 0.482585 0.470038 -0.238802 -0.251516 -0.279081 -0.233006 -0.233350 -0.217444 -0.204812 -0.002229
polarizability: 3.74104033e+02 4.30044546e+01 2.98805303e+02 -4.17167270e+01 9.22342772e+00 1.49552498e+02
1716.lowfreq: -8.8074 -4.6790 -2.1385 -0.0005 0.0005 0.0010 5.4897 18.5492 29.7029
frequency: -4.4617 18.5097 29.6600 59.7268 83.5163 89.3246 106.0957 125.5475 130.7662 189.2919 190.8150 219.5701 239.7505 248.7097 262.2021 263.5385 272.6794 291.4751 338.2626 356.0877 367.0080 400.9304 408.5161 428.2022 429.1052 447.7341 465.2990 489.8759 497.6834 507.8532 512.0373 522.3876 537.6595 554.9344 578.3752 625.3812 687.0068 695.8334 708.3907 726.8544 738.8492 745.3400 766.5047 772.6393 785.1656 809.6195 813.7895 837.4597 856.6167 859.7009 874.1993 879.0903 903.6271 920.7427 938.8911 942.5956 961.3271 969.1682 971.5088 986.9505 996.1278 1010.1813 1033.7738 1042.1217 1044.2132 1063.9191 1069.6078 1089.7966 1110.3788 1116.1366 1121.2529 1155.8023 1160.3243 1172.7433 1184.2149 1196.4421 1213.9092 1226.9681 1230.5497 1244.2727 1246.0496 1252.6873 1255.4080 1259.6280 1278.3800 1298.6124 1312.9446 1320.4486 1336.0108 1343.7545 1366.4502 1381.2073 1390.7062 1409.8809 1421.5303 1422.8635 1427.7452 1431.5456 1437.9450 1444.8173 1452.4773 1458.3387 1462.9817 1464.6150 1468.3137 1468.7350 1477.0388 1485.0960 1485.2885 1490.0863 1494.5060 1499.6525 1514.3164 1550.3147 1595.5104 1604.0259 1611.6656 1636.3580 2976.6185 2983.5834 2992.0865 3012.9269 3021.6922 3024.1929 3027.8949 3031.3151 3040.0729 3060.2852 3090.0559 3115.1121 3117.8942 3126.7701 3128.9327 3136.8040 3139.8718 3140.8486 3143.7633 3144.6936 3145.1126 3146.1164 3150.7895 3155.1513 3158.7627 3162.9502
redmass: 2.7285 4.2971 4.5930 2.1657 3.7752 2.0702 3.6848 1.8787 4.3552 2.9967 1.5217 3.8583 1.8099 1.4398 1.0815 4.3559 2.8752 3.3906 2.2234 3.7144 3.0259 5.1895 3.8913 3.2936 2.3522 3.3106 4.7141 3.5613 3.2801 4.0667 3.9438 3.5192 4.8093 3.1653 5.8506 3.9799 6.8113 3.7864 4.2260 4.1735 2.5039 1.1036 3.1708 1.4089 1.2998 4.4395 1.3727 2.2103 3.5536 2.9648 2.2990 2.5567 1.8824 1.4295 2.7560 1.9793 1.4019 4.4464 1.3563 1.3870 1.4174 4.7096 3.1366 2.1451 1.2309 2.3053 1.6038 1.4391 2.4726 1.6866 1.6930 1.3824 1.3030 1.3596 1.4348 1.3054 1.5968 1.6574 1.8892 1.6870 1.6210 1.7231 1.5510 2.2066 1.3785 1.0639 1.4409 1.2456 2.3572 1.5291 1.2990 4.7022 2.1209 2.7108 1.1461 1.1433 3.9766 6.1913 2.2259 1.0986 1.0464 1.1072 3.6324 1.0421 1.1054 1.1096 1.1128 1.0569 1.0566 1.1441 4.1146 1.0605 4.1317 4.8784 6.9450 6.7967 6.4979 7.4766 1.0592 1.0592 1.0585 1.0579 1.0995 1.0323 1.0332 1.0338 1.1027 1.1057 1.1079 1.0877 1.0853 1.0866 1.0869 1.0920 1.1054 1.1057 1.0968 1.0963 1.1051 1.1052 1.0983 1.1049 1.1044 1.0989
irintensity: 0.1106 2.1070 1.9842 0.3317 1.3134 0.0572 0.5298 0.4396 2.2346 2.2597 0.9540 9.9346 0.3038 0.4654 0.0169 0.0122 1.0444 0.0476 0.2323 0.4160 0.4043 0.2516 0.4855 0.3233 0.0520 0.6943 0.1284 0.4947 1.7666 2.9718 1.6863 0.3827 1.9128 1.7711 0.5955 8.1604 0.0832 3.3782 6.7568 1.7519 20.8014 8.2948 0.8212 11.6675 0.6888 6.1489 3.6576 6.7010 60.7658 6.2058 93.2549 55.3963 7.2643 2.8339 16.5452 7.6491 1.6916 0.2829 0.5674 2.0181 1.7980 16.9863 0.5857 1.4304 0.0916 7.8096 1.4377 3.8834 0.6632 5.3129 3.6542 0.9500 0.1446 0.7990 1.8788 19.7416 5.9253 1.6987 1.2158 3.5142 0.7944 3.5876 15.6575 3.2784 2.4432 0.4146 14.8865 0.0448 2.2219 0.5583 11.6876 5.7826 0.5188 3.5265 15.6309 19.5398 1.9075 0.5135 5.6870 2.3553 0.3312 8.5920 5.4963 0.5879 1.9049 2.8720 7.9962 48.0636 47.3458 15.7773 3.1439 99.4674 4.0406 1.3453 2.6463 7.8896 4.8516 1.8084 21.7038 11.6030 48.7280 12.9906 2.0256 4.5718 3.5167 3.3139 1.3436 28.0318 19.1166 18.3245 8.2833 0.4321 0.2810 7.6250 0.6414 0.1822 48.5889 17.2360 4.1465 12.5713 27.1812 0.7843 6.6279 30.2841
temp: 298.150 k
press: 1.00000 atm
elementType: 7 6 6 6 6 6 6 6 6 6 6 6 6 6 6 6 6 6 6 6 6 6 6 6 1 1 1 1 1 1 1 1 1 1 1 1 1 1 1 1 1 1 1 1 1 1 1 1 1 1
symmnumber: 1
zpe: 1127811.5 jmol-1
zpe.correction: 0.429561 hartree
zpe.thermalcorrener: 0.450127 hartree
zpe.thermalcorrenthalpy: 0.451071 hartree
zpe.thermalcorrgfe: 0.380168 hartree
zpe.sumelectzpe: -944.882464 hartree
zpe.sumelectthermal: -944.861898 hartree
zpe.sumelectthermalent: -944.860953 hartree
zpe.sumelectthermalfe: -944.931856 hartree
dipole: 24.7648 -2.2510 2.0608
dipole: 24.9521
quadrupole: 45.9165 -118.2321 -139.1332
quadrupole: -11.2030 4.7552 1.9754
quadrupole: 116.3994 -47.7492 -68.6502 -11.2030 4.7552 1.9754
hfenergy: -945.3120244 hartree
pointgroup: C01 [X(C23H26N1)]
dipole: -9.7339508 -1.0122374 -0.7728674 debye
polarizability: 374.6678214|-38.3552935|297.8403655|-47.1028878|1.2824064|149.9536467 unknown
InChI: InChI=1S/C23H26N/c1-24(2,3)16-5-4-7-17-10-11-20-13-12-18-8-6-9-19-14-15-21(17)23(20)22(18)19/h6,8-15H,4-5,7,16H2,1-3H3
charge 1 multiplicity 1
50 atoms
N  -6.361484 -0.609646 -0.421042
C  -4.860205 -0.268496 -0.674062
C  -4.047945 0.177426 0.549296
C  -2.592485 0.494143 0.109188
C  -1.704971 0.957772 1.299072
C  -0.28416 1.281242 0.855369
C  -7.111857 0.614086 0.098443
C  -6.977561 -1.041919 -1.752391
C  -6.492158 -1.75331 0.581549
C  0.686095 0.253374 0.62162
C  2.002128 0.61485 0.142219
C  2.991636 -0.400389 -0.104405
C  2.334418 2.000414 -0.090512
C  0.073434 2.632493 0.62711
C  2.68223 -1.789407 0.129339
C  4.303675 -0.035767 -0.583801
C  0.411643 -1.152333 0.852247
C  1.352974 2.993664 0.164084
C  1.36541 -2.127448 0.619449
C  3.656693 2.340402 -0.570597
C  4.603496 1.362046 -0.80901
C  3.672355 -2.778748 -0.116984
C  5.264656 -1.056035 -0.819093
C  4.950741 -2.412246 -0.587236
H  -4.421247 -1.1808 -1.117078
H  -4.863466 0.522765 -1.445408
H  -4.479276 1.085632 1.011606
H  -4.017749 -0.614228 1.32185
H  -2.134944 -0.399408 -0.35823
H  -2.595723 1.289708 -0.66155
H  -1.711408 0.175739 2.08349
H  -2.158737 1.860389 1.751532
H  -6.713723 0.899181 1.081969
H  -6.981191 1.444094 -0.61263
H  -8.180297 0.364672 0.190065
H  -8.041575 -1.279905 -1.600577
H  -6.879212 -0.220165 -2.477918
H  -6.44547 -1.930911 -2.123674
H  -6.110943 -1.429067 1.559579
H  -7.554251 -2.028933 0.671213
H  -5.910841 -2.61557 0.220658
H  -0.666489 3.418365 0.823915
H  -0.568121 -1.448382 1.243147
H  1.601708 4.048514 0.002062
H  1.13864 -3.182495 0.81444
H  3.893618 3.396871 -0.740295
H  5.602375 1.630664 -1.171284
H  3.435196 -3.833275 0.065219
H  6.260574 -0.778284 -1.18265
H  5.705297 -3.183941 -0.771604
