program: Gaussian 09
title: 000133650
version: EM64L-G09RevD.01
frameworkgroup: C1[X(C20H31N)]
method: RPBEPBE
basis: SDD
operation: Freq
keyword: #pfreq=noraman
keyword: PBEPBE/SDD
title: #p freq=noraman PBEPBE/SDD
converged: YES YES NO NO
title: Mulliken charges:
elementType: N C C C C C C C C C C C C C C C C C C C C H H H H H H H H H H H H H H H H H H H H H H H H H H H H H H H
charge: -0.330962 -0.007781 -0.312464 -0.466542 -0.448677 -0.433693 0.014629 -0.414518 -0.408325 -0.381805 -0.418009 -0.460678 0.553502 -0.397835 -0.395065 -0.384969 -0.379365 -0.459355 -0.252257 -0.229963 -0.249606 0.204380 0.196664 0.193338 0.210649 0.230703 0.180426 0.203378 0.195000 0.165571 0.196168 0.191207 0.192239 0.196037 0.198485 0.186903 0.208157 0.202835 0.179926 0.213752 0.249708 0.196240 0.188469 0.190309 0.197009 0.194657 0.191123 0.219659 0.226691 0.219126 0.220741 0.224192
chargesum: 0.00000
title: Mulliken charges with hydrogens summed into heavy atoms:
elementType: N C C C C C C C C C C C C C C C C C C C C
charge: -0.081253 0.196599 -0.115799 -0.062556 -0.037548 -0.035316 0.180200 -0.027143 -0.020050 0.003582 -0.007017 -0.067001 0.553502 -0.013126 -0.007747 0.000811 -0.159707 -0.232664 -0.033131 -0.009222 -0.025414
polarizability: 2.19473567e+02 7.24694282e-02 2.33211157e+02 -3.43258398e+00 -1.89415905e+00 1.88910438e+02
1716.lowfreq: -17.3531 -7.4145 -0.0007 -0.0006 -0.0004 3.9698 10.4175 28.1804 33.3085
frequency: -14.7633 28.0562 33.0572 34.9658 49.9443 61.5513 80.7384 121.9396 146.7225 177.8276 196.2984 211.1062 213.8838 218.8358 242.4623 280.2865 313.8704 317.3637 355.0531 393.0784 403.9888 414.8707 425.7346 437.6374 442.8053 461.0416 485.1314 509.7451 537.2392 575.6368 583.3299 617.8057 637.8705 704.0864 760.6796 767.5382 779.1857 781.8902 787.1579 799.0479 841.7974 844.2541 850.8275 875.0684 885.0378 890.3969 892.2151 913.5288 917.3144 919.9895 953.1669 969.0402 972.7358 984.1461 990.4238 992.0010 1026.4425 1035.6372 1042.2214 1049.8965 1052.9278 1055.3486 1056.2333 1072.9419 1081.7747 1088.9303 1095.5975 1111.3292 1114.9369 1133.0314 1145.2310 1156.7455 1170.0448 1180.0286 1188.1587 1189.6660 1202.7141 1213.2268 1218.3118 1241.9023 1251.8326 1255.3521 1256.4963 1259.2215 1268.2094 1298.4563 1302.7623 1306.5664 1309.6209 1312.0605 1324.6455 1331.7219 1334.0089 1334.8119 1336.4051 1339.4955 1339.8194 1342.7894 1344.8341 1355.9378 1362.7068 1372.2466 1384.4654 1440.9249 1457.8967 1458.2748 1460.6198 1461.0333 1462.3129 1462.4570 1466.1378 1468.5896 1469.2321 1476.1547 1476.4873 1482.1416 1496.4634 1592.6091 1612.7842 2793.9866 2872.2576 2927.5256 2939.3979 2949.7881 2958.5907 2958.8820 2961.9043 2962.8060 2963.1140 2964.4441 2967.1696 2968.4355 2974.7976 2980.4456 3018.1681 3022.8038 3023.6946 3026.4111 3027.7149 3031.2295 3034.8575 3035.1860 3042.6794 3044.1651 3105.8690 3114.4837 3128.4805 3139.5023 3158.9713 3430.3146
redmass: 2.8268 3.5765 3.3839 3.4846 3.8158 4.1229 3.0836 3.0653 2.5399 4.3489 3.4090 2.3117 1.8683 1.8593 3.7644 3.8249 1.8295 1.8027 2.7812 3.6406 2.7897 2.0550 2.8027 3.1681 2.3154 2.0330 2.2792 1.6030 2.5323 2.4240 2.6154 6.1239 2.5031 1.6850 2.0614 3.0495 1.9612 1.4890 1.6809 2.2782 2.1045 1.9053 1.2529 1.7261 1.8850 1.5349 1.4971 1.7712 1.6669 1.9078 2.4958 2.1004 1.4568 2.1780 1.3161 4.0471 2.2183 2.2823 2.7478 1.5462 1.2982 1.1901 1.7014 1.6207 1.6953 1.8034 1.7735 2.3390 2.4704 1.8616 2.2958 3.2756 1.0587 1.5486 1.1866 1.5839 1.5796 1.3034 1.7577 1.3420 1.2660 1.2856 1.2578 1.2092 1.3100 1.1921 1.3078 1.2494 1.3319 1.3268 1.4105 1.3954 1.3886 1.4134 1.4958 1.4809 1.5080 1.5027 1.3956 1.4321 1.4610 1.5247 5.7978 2.1520 1.1493 1.0908 1.0916 1.0899 1.0950 1.0951 1.1591 1.0816 1.0904 1.0964 1.0961 2.2984 1.0831 6.0235 6.1593 1.0800 1.0695 1.0795 1.0793 1.0657 1.0685 1.0617 1.0606 1.0625 1.0628 1.0631 1.0605 1.0657 1.0689 1.0810 1.0986 1.0971 1.0963 1.0945 1.1007 1.0981 1.1023 1.0992 1.0992 1.1031 1.0875 1.0856 1.0903 1.0957 1.1013 1.0745
irintensity: 0.1814 0.0883 0.0208 0.1059 0.1304 0.1277 0.7475 0.4074 0.7216 0.1653 0.1477 0.5426 0.0684 0.8401 1.2215 0.0566 0.1091 3.0498 9.4007 0.1088 0.2137 0.0617 1.1856 0.0788 5.3193 9.5550 16.6615 27.1686 3.6636 16.0402 9.7869 0.2069 29.0352 53.8882 25.7151 10.7581 0.7334 1.0314 0.3376 4.8737 12.4214 3.7823 0.0320 3.0172 0.5302 14.2752 6.9568 0.5767 4.7998 0.5144 7.7510 0.8366 0.1677 0.8022 0.1600 0.9577 4.4866 1.6729 5.7605 1.1781 0.6520 0.1273 0.5616 2.1867 5.6251 3.2829 1.7317 0.5012 0.4905 6.7681 3.1324 48.8890 0.1135 19.7338 0.1712 0.0389 0.6767 6.9273 1.7409 0.6222 1.6368 1.9736 2.0829 2.3376 5.3054 1.0453 2.2353 2.6262 1.2286 1.2555 0.7344 1.0257 1.5433 0.6756 5.0067 0.9066 1.3983 14.3870 0.5019 4.5667 21.3562 19.7165 0.2870 8.5226 9.2498 0.1295 4.8713 9.8473 8.3191 3.6552 19.7190 18.1394 21.7430 0.4084 3.1390 15.7061 3.8160 1.3546 9.4350 98.3859 103.4529 2.7089 8.4322 19.0216 27.3289 40.9463 28.5583 43.1717 39.5882 43.1796 44.8737 35.3860 11.0224 76.5480 64.3952 78.8483 98.5484 57.7994 41.5071 10.1868 11.1088 45.6841 88.5064 134.2288 11.7541 5.7413 11.2264 46.7123 28.5294 2.2549
temp: 298.150 k
press: 1.00000 atm
elementType: 7 6 6 6 6 6 6 6 6 6 6 6 6 6 6 6 6 6 6 6 6 1 1 1 1 1 1 1 1 1 1 1 1 1 1 1 1 1 1 1 1 1 1 1 1 1 1 1 1 1 1 1
symmnumber: 1
zpe: 1223787.8 jmol-1
zpe.correction: 0.466116 hartree
zpe.thermalcorrener: 0.485825 hartree
zpe.thermalcorrenthalpy: 0.486769 hartree
zpe.thermalcorrgfe: 0.416785 hartree
zpe.sumelectzpe: -833.845923 hartree
zpe.sumelectthermal: -833.826214 hartree
zpe.sumelectthermalent: -833.825270 hartree
zpe.sumelectthermalfe: -833.895255 hartree
dipole: 0.0312 -0.9768 -0.5908
dipole: 1.1420
quadrupole: -131.7786 -127.8204 -123.7030
quadrupole: 0.5530 0.2047 -0.2507
quadrupole: -4.0113 -0.0531 4.0644 0.5530 0.2047 -0.2507
hfenergy: -834.3120395 hartree
pointgroup: C01 [X(C20H31N1)]
dipole: 0.0217007 -0.3933331 -0.2160765 debye
polarizability: 219.5835388|-0.2044501|232.9747741|-2.8656154|-3.7670975|189.0368485 unknown
InChI: InChI=1S/C20H31N/c1-4-10-17(11-5-1)20(18-12-6-2-7-13-18)16-21-19-14-8-3-9-15-19/h1,4-5,10-11,18-21H,2-3,6-9,12-16H2
charge 0 multiplicity 1
52 atoms
N  -1.546437 -0.115731 -0.488482
C  2.221028 -0.870281 0.193379
C  0.958617 -0.174022 -0.429126
C  2.210907 -2.415462 0.044817
C  3.525413 -0.293583 -0.421751
C  -0.369149 -0.832742 0.037833
C  -2.841114 -0.824854 -0.393978
C  3.485775 -3.065978 0.636825
C  4.796562 -0.938415 0.177832
C  4.774253 -2.475922 0.020067
C  -3.310532 -0.935769 1.078987
C  -3.900707 -0.073796 -1.233665
C  0.969231 1.331964 -0.143383
C  -4.69816 -1.612052 1.186147
C  -5.290904 -0.745216 -1.138378
C  -5.753971 -0.869239 0.333354
C  0.823244 1.82403 1.179945
C  1.152508 2.270787 -1.188797
C  0.857542 3.208557 1.448579
C  1.186517 3.660601 -0.927637
C  1.039937 4.135807 0.394709
H  2.227571 -0.636402 1.281773
H  1.023247 -0.308796 -1.532615
H  2.132048 -2.673842 -1.033413
H  1.323882 -2.849332 0.543271
H  3.55426 0.802892 -0.282274
H  3.509567 -0.476534 -1.518367
H  -0.370494 -1.903967 -0.28043
H  -0.403412 -0.832951 1.146746
H  -2.763166 -1.872404 -0.798263
H  3.451645 -4.162671 0.484534
H  3.500906 -2.896492 1.734009
H  4.861536 -0.683258 1.256246
H  5.698291 -0.513454 -0.304832
H  5.668495 -2.927763 0.492057
H  4.81456 -2.733088 -1.059126
H  -3.349098 0.089656 1.498249
H  -2.56951 -1.503126 1.674901
H  -3.572963 -0.025308 -2.293306
H  -3.957822 0.969657 -0.863354
H  -1.380287 0.251031 -1.435863
H  -5.017573 -1.649673 2.245753
H  -4.624328 -2.66379 0.83813
H  -5.243221 -1.757294 -1.591547
H  -6.029544 -0.166158 -1.725911
H  -6.728213 -1.39351 0.384956
H  -5.910369 0.146329 0.752029
H  0.664674 1.11991 2.006061
H  1.273461 1.909218 -2.218411
H  0.737488 3.567719 2.477432
H  1.327914 4.368246 -1.75291
H  1.064994 5.211569 0.6026
