program: Gaussian 09
title: 000133649
version: EM64L-G09RevD.01
frameworkgroup: C1[X(C21H28O5)]
method: RPBEPBE
basis: SDD
operation: Freq
keyword: #pfreq=noraman
keyword: PBEPBE/SDD
title: #p freq=noraman PBEPBE/SDD
converged: YES YES NO NO
title: Mulliken charges:
elementType: O O O O O C C C C C C C C C C C C C C C C C C C C C H H H H H H H H H H H H H H H H H H H H H H H H H H H H
charge: -0.416707 -0.239441 -0.237174 -0.444339 -0.229545 0.379461 -0.098299 -0.161057 -0.142655 -0.233545 -0.539730 0.114807 -0.561161 -0.506619 -0.473427 -0.488611 -0.824157 0.541039 -0.640484 -0.483369 0.085946 0.100240 -0.558505 -0.580369 0.181461 -0.382559 0.211454 0.284831 0.214769 0.239331 0.204100 0.215337 0.213526 0.241983 0.231981 0.226397 0.263295 0.215245 0.230666 0.213946 0.226000 0.236689 0.250364 0.261209 0.233604 0.215955 0.237616 0.244436 0.256548 0.260152 0.237967 0.225118 0.380301 0.365979
chargesum: 0.00000
title: Mulliken charges with hydrogens summed into heavy atoms:
elementType: O O O O O C C C C C C C C C C C C C C C C C C C C C
charge: -0.036407 -0.239441 -0.237174 -0.078361 -0.229545 0.379461 0.113155 0.123774 0.072114 0.005786 -0.120293 0.114807 -0.105652 -0.048241 0.005113 -0.043999 -0.111103 0.541039 -0.145671 -0.029798 0.085946 0.100240 -0.057522 -0.320217 0.181461 0.080526
polarizability: 3.05124830e+02 -3.36112337e+00 2.16261748e+02 -2.07548588e+01 4.63465234e+00 1.85810025e+02
1716.lowfreq: -8.2530 -0.0003 0.0002 0.0005 7.9669 9.3375 28.0412 34.7347 46.5064
frequency: 27.9073 34.6792 46.4978 50.2566 56.8318 73.0923 96.6661 121.0429 136.1608 147.5341 163.8737 171.7522 184.6836 197.0218 202.7250 214.3758 232.7663 251.1453 277.4524 283.4318 307.0554 318.1815 324.9710 337.5040 360.4823 376.8445 383.5676 398.9870 417.1729 425.3129 433.1629 464.2353 486.2446 493.9915 507.4948 518.2181 548.1636 555.9585 562.1297 604.6629 621.3131 637.3822 651.2708 662.5286 681.1966 697.5039 733.8457 760.8058 772.4818 813.1521 822.2041 832.1277 846.8664 863.1580 875.4786 899.0092 907.3666 918.3602 931.4842 942.5317 949.8705 970.7496 986.5885 1000.6208 1004.3175 1011.3757 1013.5912 1027.6282 1028.7923 1039.6578 1040.6519 1058.1472 1075.6010 1080.3682 1093.5341 1108.9810 1116.2119 1122.3455 1126.8817 1135.3392 1161.9337 1169.5084 1178.9035 1179.4992 1185.3375 1191.8952 1208.4999 1219.6441 1233.1363 1235.6215 1241.8801 1250.8612 1252.5897 1258.9082 1274.0925 1277.5949 1284.4204 1291.8111 1297.1726 1305.3878 1319.9038 1326.1551 1327.3539 1330.8498 1335.7382 1339.4540 1341.3897 1352.3210 1355.9287 1361.3813 1371.5382 1387.4417 1405.4990 1443.0127 1444.3989 1448.8192 1458.4163 1464.0900 1468.9827 1470.3381 1474.8269 1478.4754 1493.2573 1495.0698 1587.1377 1603.6970 1625.0579 1625.8971 2905.5053 2931.6322 2939.1048 2955.8340 2965.2544 2973.0722 2974.4039 2989.3242 2991.1439 2993.8208 2995.2503 2997.3619 2998.6277 3002.9777 3017.0152 3020.8560 3041.9102 3048.3065 3050.6852 3056.5715 3068.6122 3079.9745 3083.4511 3086.8845 3100.4272 3122.6726 3410.2318 3491.8306
redmass: 7.0734 6.2979 7.4742 5.5228 5.8534 4.4547 3.3620 3.7062 2.4741 3.0211 3.9991 3.1727 3.2946 2.5219 3.0919 2.2231 3.1578 2.1453 2.7781 2.9505 3.0771 4.0487 4.1384 3.3600 3.1775 3.7354 2.8566 2.5481 1.7438 3.6103 3.4030 2.1720 2.6317 3.4005 3.1187 3.2613 2.8812 2.8651 2.6754 2.2067 2.6672 2.5857 2.4378 3.5922 2.8515 3.1080 3.5458 3.4737 2.3430 2.2023 2.2477 1.7002 2.4283 2.1996 1.8498 3.0729 1.9305 2.0281 2.0275 2.4476 1.9013 2.1885 2.5231 2.5572 2.9022 2.7852 2.5240 1.9969 2.4389 2.2659 3.3493 2.2168 2.4602 2.9521 1.7407 2.9322 2.0010 1.9710 2.2655 1.4849 2.3546 1.5415 1.5272 1.2341 1.6073 1.9670 1.5158 1.2379 1.4523 1.5611 1.4500 1.3726 1.3823 1.4228 1.4312 1.8458 1.6035 1.3933 1.3771 1.5963 1.4489 1.5468 1.5336 1.3497 1.6377 1.3873 1.5178 1.4804 1.3886 1.4463 1.4793 1.4240 1.1937 1.0756 1.0783 1.0931 1.0753 1.0872 1.0863 1.0836 1.0753 1.0747 1.0830 1.0613 10.0167 7.0569 8.6032 7.7808 1.0811 1.0820 1.0649 1.0614 1.0650 1.0821 1.0612 1.0636 1.0675 1.0929 1.0415 1.0627 1.0607 1.0808 1.0639 1.0954 1.0965 1.1004 1.1002 1.1005 1.0969 1.0990 1.1014 1.0951 1.0986 1.0912 1.0640 1.0638
irintensity: 4.4057 1.2923 1.0107 0.7415 2.2431 1.0695 6.3104 2.6434 0.0234 0.2050 1.1473 1.1756 3.7073 3.0519 1.5151 0.4551 0.1163 2.9470 0.0609 0.9169 4.6015 18.3336 3.1141 11.4404 5.8637 3.5659 4.5253 38.7394 46.2457 1.4862 6.6497 23.1743 8.7197 5.0923 10.5251 1.1868 1.7682 4.9605 17.0448 38.0454 18.5166 18.0458 41.3679 27.0040 3.1869 35.6232 2.0294 2.3604 12.1826 0.3538 1.6608 1.7971 8.8700 16.2805 8.3570 31.9523 11.6682 4.6094 12.5061 5.4715 6.7359 11.6115 20.9336 23.3924 43.8052 9.9471 131.6690 2.7113 31.3669 15.4449 47.1316 81.8288 26.7859 12.4835 0.2081 10.2032 35.4069 4.9313 4.8319 2.6073 0.3156 4.8025 1.3172 14.6000 6.5431 3.0489 17.6582 15.3478 22.0639 17.5207 39.1612 70.7453 34.1312 4.3826 5.2538 22.8254 20.7901 19.9847 2.7839 12.1231 6.0555 5.0846 7.0039 1.3829 13.5289 2.0574 36.4928 10.5236 1.8051 2.2235 42.0560 45.0965 27.3409 12.2331 16.8309 23.3537 1.8456 9.4149 8.4736 7.4710 14.7771 3.9626 6.3142 9.5123 183.4936 76.8672 194.1461 146.4852 15.5597 13.0700 33.1831 33.6364 29.0906 30.0152 12.7996 14.9180 8.4833 24.2636 11.9287 27.9116 22.5346 20.5474 36.8189 42.7616 37.2477 19.2918 41.4738 19.7457 16.5409 23.5946 32.5475 15.8464 22.0091 7.6371 26.6012 32.0920
temp: 298.150 k
press: 1.00000 atm
elementType: 8 8 8 8 8 6 6 6 6 6 6 6 6 6 6 6 6 6 6 6 6 6 6 6 6 6 1 1 1 1 1 1 1 1 1 1 1 1 1 1 1 1 1 1 1 1 1 1 1 1 1 1 1 1
symmnumber: 1
zpe: 1188988.9 jmol-1
zpe.correction: 0.452862 hartree
zpe.thermalcorrener: 0.477276 hartree
zpe.thermalcorrenthalpy: 0.478221 hartree
zpe.thermalcorrgfe: 0.399336 hartree
zpe.sumelectzpe: -1191.171899 hartree
zpe.sumelectthermal: -1191.147485 hartree
zpe.sumelectthermalent: -1191.146541 hartree
zpe.sumelectthermalfe: -1191.225425 hartree
dipole: -0.9768 0.8600 -0.2730
dipole: 1.3298
quadrupole: -223.4156 -151.5572 -154.4089
quadrupole: -12.9962 17.4648 -7.1511
quadrupole: -46.9550 24.9033 22.0517 -12.9962 17.4648 -7.1511
hfenergy: -1191.6247611 hartree
pointgroup: C01 [X(C21H28O5)]
dipole: -0.3848455 0.336552 -0.111095 debye
polarizability: 305.5384201|-2.9920437|216.2329797|-19.637622|4.5079325|185.4252037 unknown
InChI: InChI=1S/C21H28O5/c1-20-8-7-16-14(15(20)4-5-17(20)18(24)11-22)3-2-12-10-13(23)6-9-21(12,16)19(25)26/h10,14-17,22,25H,2-9,11H2,1H3
charge 0 multiplicity 1
54 atoms
O  2.601033 -2.085284 1.867728
O  -5.521419 0.003718 0.716256
O  1.894052 0.004071 2.536319
O  -6.346616 -2.198844 -0.562925
O  6.265675 -0.22325 -1.401152
C  -2.245867 0.013142 -0.026852
C  -1.337656 1.2388 -0.375407
C  0.089203 1.120649 0.198367
C  0.740533 -0.177047 -0.37436
C  -3.59121 0.501664 -0.716556
C  -1.602918 -1.248827 -0.647479
C  2.245603 -0.411529 0.097537
C  -2.202724 2.465413 -0.001861
C  -0.144999 -1.435303 -0.146672
C  -3.660268 2.028647 -0.372789
C  0.95477 2.34905 -0.156594
C  -2.462064 -0.170453 1.499013
C  3.049658 0.903688 -0.057569
C  2.392093 2.189836 0.394198
C  2.880821 -1.539191 -0.76966
C  -4.820404 -0.278558 -0.300084
C  2.224149 -0.762264 1.600898
C  4.413788 -1.638037 -0.64408
C  4.318748 0.908121 -0.577328
C  5.090909 -0.302447 -0.928066
C  -5.238243 -1.482183 -1.15045
H  -1.236816 1.237961 -1.486831
H  0.039931 1.051962 1.302651
H  0.820757 -0.019248 -1.474304
H  -3.450235 0.362411 -1.808961
H  -1.599027 -1.152745 -1.753995
H  -2.182784 -2.160405 -0.401256
H  -1.896179 3.376409 -0.544805
H  -2.120135 2.685714 1.079075
H  -0.160858 -1.692514 0.930241
H  0.294805 -2.30526 -0.666944
H  -4.359462 2.188226 0.465773
H  -4.048512 2.59702 -1.23641
H  0.504668 3.26539 0.26841
H  0.983921 2.479438 -1.258587
H  -3.035346 -1.09358 1.701377
H  -1.505663 -0.248027 2.042176
H  -3.032839 0.664132 1.939329
H  2.330696 2.174678 1.501623
H  3.022513 3.050881 0.107593
H  2.621101 -1.322513 -1.824917
H  2.435758 -2.512429 -0.509701
H  4.823348 -2.397052 -1.33345
H  4.687625 -1.957355 0.380962
H  4.845732 1.860284 -0.721925
H  -4.373514 -2.165517 -1.277009
H  -5.510617 -1.105871 -2.161814
H  2.553883 -2.237269 2.852042
H  -6.640299 -1.662204 0.229028
