program: Gaussian 09
title: 000011914
version: EM64L-G09RevD.01
frameworkgroup: C1[X(C8H8O3)]
method: RPBEPBE
basis: SDD
operation: Freq
keyword: #p
keyword: freq=noraman
keyword: PBEPBE/SDD
title: #p freq=noraman PBEPBE/SDD
converged: YES YES NO NO
title: Mulliken charges:
elementType: O O O C C C C C C C C H H H H H H H H
charge: -0.448355 -0.401846 -0.236661 0.370335 -0.268692 -0.361035 -0.381833 -0.219919 -0.215541 -0.237774 0.166646 0.271806 0.255974 0.267301 0.226971 0.228358 0.229792 0.365392 0.389079
chargesum: 0.00000
title: Mulliken charges with hydrogens summed into heavy atoms:
elementType: O O O C C C C C C C C
charge: -0.082963 -0.012767 -0.236661 0.370335 0.003114 -0.105061 -0.114531 0.007052 0.012817 -0.007982 0.166646
polarizability: 1.14295980e+02 1.81121555e+00 9.92010024e+01 4.57078466e+00 -8.99166723e+00 5.64184166e+01
1716.lowfreq: -13.2010 -6.3763 0.0005 0.0007 0.0007 4.0449 25.3034 62.2650 110.8552
frequency: 24.8183 62.2640 110.8527 193.0519 241.7142 282.3657 353.8709 369.0329 406.9370 435.0818 475.6971 550.7868 602.2258 614.9074 632.7228 689.4466 705.5906 741.6910 835.1977 858.6061 866.1583 936.2757 982.7019 989.9954 1000.0489 1010.8888 1027.2705 1065.0037 1088.8594 1168.5202 1173.9587 1189.0737 1211.6278 1261.1527 1300.6068 1316.9662 1375.4152 1390.3704 1436.5648 1477.9037 1594.4919 1609.4206 1646.8813 3036.5469 3125.2980 3134.7753 3147.3999 3160.2439 3170.9988 3474.2068 3507.1333
redmass: 4.5040 10.1414 5.3805 5.1730 5.4409 5.8288 3.5800 1.4536 2.5230 4.0841 3.0904 2.7201 2.7980 5.8779 2.5604 4.0797 2.1734 1.6676 3.6956 1.2449 3.6934 1.4796 1.5340 3.9948 1.3396 5.2726 2.2011 2.1895 1.6151 1.6630 1.2632 1.2641 1.3224 1.4224 1.7158 1.3192 2.2028 2.7184 2.1774 2.2121 6.2883 6.0333 8.7065 1.0845 1.0847 1.0884 1.0935 1.0968 1.0984 1.0652 1.0641
irintensity: 0.8300 1.7631 0.6426 7.2937 2.3564 5.7175 50.0414 88.1045 15.5102 5.6782 6.6826 35.6840 84.2640 3.3348 78.7326 42.4129 40.6590 65.1661 5.8164 0.2179 26.1140 4.5420 1.4941 0.7271 0.9582 168.3826 19.6662 117.1575 22.6308 16.0099 6.6764 2.3267 17.2947 30.9574 51.0235 1.6927 17.4368 10.0186 12.6502 22.7745 1.2240 12.6254 214.9432 9.3704 0.1314 8.0507 21.4537 20.4992 13.6156 36.4116 29.6562
temp: 298.150 k
press: 1.00000 atm
elementType: 8 8 8 6 6 6 6 6 6 6 6 1 1 1 1 1 1 1 1
symmnumber: 1
zpe: 377204.2 jmol-1
zpe.correction: 0.143669 hartree
zpe.thermalcorrener: 0.153534 hartree
zpe.thermalcorrenthalpy: 0.154479 hartree
zpe.thermalcorrgfe: 0.107197 hartree
zpe.sumelectzpe: -534.514838 hartree
zpe.sumelectthermal: -534.504973 hartree
zpe.sumelectthermalent: -534.504028 hartree
zpe.sumelectthermalfe: -534.551310 hartree
dipole: 0.4380 2.4056 0.6437
dipole: 2.5285
quadrupole: -58.6244 -58.1557 -68.3147
quadrupole: -5.8061 1.8163 -2.0792
quadrupole: 3.0739 3.5425 -6.6165 -5.8061 1.8163 -2.0792
hfenergy: -534.658507 hartree
pointgroup: C01 [X(C8H8O3)]
dipole: -0.2644202 0.2464098 0.9268034 debye
dipolederiv: -0.7156626 0.1359499 0.0989229 0.1309232 -0.2705608 -0.0063392 0.1924791 0.0010399 -0.5981198 -0.3900859 0.0939272 -0.0322715 0.0619731 -0.3283341 0.151755 -0.0450174 0.2334001 -1.1505243 -0.7117792 -0.261264 0.1349374 -0.4638101 -0.5701607 0.1700337 -0.0380551 0.0191054 -0.6575205 0.2204739 -0.0140691 0.0680843 -0.168014 -0.0767417 -0.0754461 -0.0659481 -0.0470091 -0.118359 0.2488848 -0.1902737 -0.258459 -0.0644087 0.2185075 -0.080338 -0.3294291 0.0032248 0.3899548 -0.1439533 -0.0421349 0.059871 -0.0245862 -0.1271436 -0.0513861 0.0393624 -0.0505073 0.011093 -0.1801078 -0.01098 -0.0890851 -0.0228296 -0.1258806 0.0137102 -0.0202146 -0.0188115 0.0153368 -0.016071 -0.0189446 -0.0890398 -0.007997 -0.1294386 -0.0346247 -0.0955031 -0.0423055 0.0712867 -0.0127785 -0.0714211 0.0724278 -0.0431785 -0.0977744 -0.0848212 0.0552309 -0.086221 0.0705675 0.0594288 -0.0831294 -0.0204311 -0.0790966 -0.1260494 -0.0189585 -0.0081096 -0.0242298 -0.0741397 0.8360881 0.4209859 -0.0056876 0.6848088 0.625541 -0.2387126 0.2558708 -0.2162105 1.3331757 0.0120588 0.0284319 0.0245761 0.0337772 -0.0306706 0.0654628 0.02922 0.0571826 0.0157358 0.0908934 0.0566764 -0.0608063 0.0446391 0.1137894 0.0594166 -0.0601855 0.0595081 -0.0040574 0.1113426 -0.0021542 0.0753857 -0.0106153 0.1467123 0.014792 0.0623005 0.0257977 0.0035522 0.020333 0.0122388 0.0947669 0.0168603 0.1419342 0.0340607 0.1116715 0.0323136 -0.06248 0.0349219 0.0561935 -0.0667751 0.068561 0.1123763 0.0820448 -0.0751308 0.0844327 -0.0482619 -0.1086216 0.086419 0.0138234 0.0861145 0.1272115 0.0144237 0.0148459 0.0142087 0.0951497 0.3697419 -0.0588272 0.0198425 -0.0782306 0.1527509 0.048479 -0.0267018 -0.0160076 0.3839139 0.2748928 -0.1376243 -0.0400826 -0.1648906 0.2439316 -0.0635524 0.003314 -0.0289114 0.3236966 unknown
polarizability: 113.5338819|-8.192887|58.0500368|-0.9859766|-10.7812973|98.3314806 unknown
InChI: InChI=1S/C8H8O3/c9-7(8(10)11)6-4-2-1-3-5-6/h1-5,7,9-10H
charge 0 multiplicity 1
19 atoms
O  1.658418 -0.758092 -1.631876
O  1.907372 -0.244536 1.964783
O  2.813261 0.943504 0.181967
C  -0.33004 -0.279786 -0.197845
C  1.12565 -0.787307 -0.279994
C  -1.065062 -0.388831 1.009149
C  -0.944857 0.274692 -1.343766
C  -2.401715 0.063326 1.068116
C  -2.282013 0.729925 -1.28059
C  -3.013874 0.627502 -0.075931
C  2.036808 0.063069 0.617984
H  1.1702 -1.83504 0.066577
H  -0.592738 -0.818907 1.899435
H  -0.378576 0.319043 -2.27877
H  -2.964525 -0.025728 2.004112
H  -2.752284 1.15624 -2.173873
H  -4.051007 0.978042 -0.029265
H  2.202136 0.071712 -1.728358
H  2.483346 0.357471 2.510546
