program: Gaussian 09
title: 000133648
version: EM64L-G09RevD.01
frameworkgroup: C1[X(C4H10N2O6P2)]
method: RPBEPBE
basis: SDD
operation: Freq
keyword: #p
keyword: freq=noraman
keyword: PBEPBE/SDD
title: #p freq=noraman PBEPBE/SDD
converged: YES YES NO NO
title: Mulliken charges:
elementType: P P O O O O O O N N C C C C H H H H H H H H H H
charge: 1.315505 1.373482 -0.661037 -0.690560 -0.741698 -0.664252 -0.587571 -0.570719 -0.134335 -0.598513 -0.763945 -0.424673 -0.538753 0.209260 0.297255 0.293799 0.288175 0.250079 0.427838 0.398960 0.422566 0.424510 0.335395 0.339228
chargesum: 0.00000
title: Mulliken charges with hydrogens summed into heavy atoms:
elementType: P P O O O O O O N N C C C C
charge: 1.315505 1.373482 -0.233198 -0.291599 -0.319132 -0.239741 -0.587571 -0.570719 -0.134335 0.076110 -0.763945 0.166381 -0.000499 0.209260
polarizability: 1.45220454e+02 -2.67927221e+00 1.13029745e+02 -1.25581398e+00 7.37733382e-01 1.09689442e+02
1716.lowfreq: -9.7187 -0.0010 0.0009 0.0010 4.2076 5.7832 41.9761 48.9811 74.0992
frequency: 41.7944 48.7126 74.0936 103.0155 121.8133 134.0577 164.6964 178.9281 202.5499 211.9339 226.3646 250.8115 267.0604 282.3429 298.4525 320.7408 333.8151 353.0421 355.1488 406.1711 435.7369 447.7035 453.3813 508.4338 598.9071 604.2789 634.2488 652.8020 659.2018 712.4834 726.9049 734.6370 757.0454 805.8849 833.2968 897.7800 940.8083 987.5017 1002.0065 1015.1680 1050.5390 1052.6774 1057.3386 1077.2386 1114.4019 1123.3555 1174.5239 1203.8017 1219.2076 1280.1399 1309.8253 1425.8095 1441.5728 1475.0244 1596.9685 1650.4703 3014.0981 3019.6686 3052.4919 3078.2453 3118.2633 3386.7691 3545.0325 3594.6212 3612.9899 3692.8480
redmass: 7.9328 3.6540 4.8794 3.9989 2.9576 5.2625 4.5762 2.5906 4.6363 2.5457 3.8622 3.7626 5.6120 3.8229 2.8230 4.0715 6.2856 5.9147 4.5353 6.5820 3.9840 1.4937 3.5602 1.5714 1.6181 1.4379 3.1994 6.6310 4.6029 4.2293 4.7112 1.9516 3.2264 5.9267 2.1566 2.2269 3.8319 2.7206 1.3857 1.4239 4.3126 2.2477 4.0670 3.4705 2.0048 1.2884 1.2333 1.2201 1.3197 1.3127 1.3465 4.4760 1.1071 1.0875 1.9029 2.1988 1.0592 1.0686 1.0636 1.1027 1.0990 1.0648 1.0462 1.0660 1.0664 1.1038
irintensity: 2.4702 30.2999 4.1224 27.8743 0.1800 10.8987 12.0363 52.6567 12.7347 53.0487 14.8895 25.1548 6.5061 15.3266 9.5716 56.2410 7.5450 10.7183 48.1866 55.4095 12.9249 101.8747 11.0927 116.0572 14.3089 116.5006 44.5662 66.2717 116.0599 107.4067 80.5378 90.2540 284.9951 17.9594 12.6855 2.5913 5.6919 9.1585 50.0031 54.7628 17.6450 27.4708 58.9073 130.6095 66.8309 134.3866 8.4310 344.7398 17.2306 4.0112 12.4228 34.4469 18.6369 27.2122 100.9908 556.8219 16.7438 4.3884 294.9965 8.8070 1.1786 153.7382 104.3824 54.2048 95.5028 49.4339
temp: 298.150 k
press: 1.00000 atm
elementType: 15 15 8 8 8 8 8 8 7 7 6 6 6 6 1 1 1 1 1 1 1 1 1 1
symmnumber: 1
zpe: 431562.9 jmol-1
zpe.correction: 0.164374 hartree
zpe.thermalcorrener: 0.180976 hartree
zpe.thermalcorrenthalpy: 0.181920 hartree
zpe.thermalcorrgfe: 0.120826 hartree
zpe.sumelectzpe: -1400.621331 hartree
zpe.sumelectthermal: -1400.604729 hartree
zpe.sumelectthermalent: -1400.603785 hartree
zpe.sumelectthermalfe: -1400.664878 hartree
dipole: 6.9962 0.6719 -0.0611
dipole: 7.0286
quadrupole: -67.8292 -108.4348 -104.8873
quadrupole: -5.4230 -1.1133 -7.1146
quadrupole: 25.8879 -14.7177 -11.1702 -5.4230 -1.1133 -7.1146
hfenergy: -1400.7857048 hartree
pointgroup: C01 [X(C4H10N2O6P2)]
dipole: 2.136301 -1.7169946 -0.3672205 debye
dipolederiv: 1.5879353 0.1209464 -0.0353903 0.2466977 1.7824452 0.0332265 -0.0194524 0.1465634 1.3736339 1.6503094 -0.1656181 0.0260695 -0.0758204 1.6563844 0.1631514 -0.0914824 0.1602151 1.3965479 -1.0070607 -0.0016489 0.20049 -0.0602968 -0.6177901 -0.1435921 0.2821916 -0.1794085 -0.7703493 -0.5111717 0.1115224 0.0503003 -0.022424 -1.1375184 0.1477248 0.0422044 0.1361428 -0.5812117 -1.2107435 0.1222595 -0.0190552 0.1167541 -0.7413354 -0.1757687 -0.0382175 -0.1310035 -0.4986022 -0.6984619 0.0560634 0.0523589 0.1257815 -0.7866673 0.0082822 0.1947303 0.0329963 -0.8770084 -0.6958977 -0.0566778 -0.0811423 -0.1432003 -0.6275777 -0.0479184 -0.1094373 -0.0218383 -0.6472938 -0.5390404 0.0095761 -0.0196154 0.0539835 -0.79401 -0.1061012 -0.0333869 -0.0837467 -0.5913816 -1.247877 0.3142682 0.3249713 0.5976766 -0.6909262 -0.1481312 -0.1522229 0.14457 -0.4281274 -1.2116379 0.1560926 0.3720815 0.1027731 -0.6139796 -0.2065993 0.6749717 -0.3398768 -0.5745661 0.2790764 -0.1386837 -0.1243389 -0.0546184 -0.1737691 0.0779193 -0.2960155 -0.0433685 -0.1057659 -0.0631579 0.0265029 -0.0619881 -0.0320881 -0.0331361 0.0350539 0.0480455 -0.0530002 -0.0506919 0.0157881 0.1053301 0.066791 0.0955075 0.0211628 0.11314 0.0453825 0.1047165 -0.1722181 1.6598652 -0.5906779 -0.5308301 -0.712941 0.4394733 0.0846112 -0.3892338 0.0622567 0.644478 0.0587084 -0.0181307 0.0717887 -0.0068381 0.0598557 0.0578737 0.0778797 0.0348876 0.0557283 0.0304857 -0.0335548 -0.0299557 -0.0408971 0.0429598 -0.0841217 -0.0246679 -0.0500943 0.0709656 0.1167446 -0.0339284 0.0227149 0.027612 -0.0516602 -0.0117884 -0.0098315 -0.0213052 0.0751905 -0.113254 0.01462 -0.083768 -0.0229959 0.099147 -0.0277673 -0.0605529 0.0183992 0.0554569 0.4400604 0.0708327 -0.059487 0.0487852 0.3837297 0.0677535 -0.0545631 -0.018308 0.2949875 0.2145185 -0.0596103 -0.0917998 -0.0743237 0.2856186 -0.04018 -0.0956285 -0.0218306 0.3198822 0.3343795 -0.0393968 -0.0049699 -0.0756468 0.2860283 0.0862871 -0.001141 0.108781 0.2861492 0.3918618 -0.0938424 -0.0195536 -0.2140089 0.5696348 -0.0046065 0.0470901 -0.1035482 0.3206523 0.2949111 0.0520887 -0.0198364 0.0241312 0.3433324 0.0682514 0.0178135 0.0521948 0.1807803 0.2236582 0.0716668 -0.0058353 0.0963973 0.2985983 0.0532996 -0.0544757 0.0656054 0.2227638 unknown
polarizability: 137.8103148|-13.4656189|120.073572|-3.1246832|2.3758342|110.0557539 unknown
InChI: InChI=1S/C4H10N2O6P2/c5-3-1-2-4(6-3,13(7,8)9)14(10,11)12/h7-8,10-11H,1-2,5H2
charge 0 multiplicity 1
24 atoms
P  -1.519248 -0.938654 0.00595
P  -0.492471 1.995804 0.411518
O  -2.546384 -0.640735 1.364402
O  -0.855079 -2.475055 0.462253
O  -2.241387 1.884466 0.42139
O  -0.1490 2.450654 -1.207635
O  -2.193992 -0.904913 -1.432333
O  0.110898 2.884152 1.578428
N  0.953426 0.078333 -0.803372
N  3.052676 -0.905284 -1.265177
C  0.024706 0.143768 0.350158
C  0.80196 -0.31688 1.61651
C  1.977223 -1.133647 1.014508
C  2.013157 -0.629624 -0.425172
H  0.181934 -0.914786 2.299758
H  1.169603 0.572381 2.160466
H  1.745449 -2.214331 1.01771
H  2.934218 -0.971158 1.540043
H  -2.909369 0.292982 1.300123
H  -1.394233 -3.244129 0.14716
H  -2.708726 2.502252 -0.194221
H  0.375061 1.665224 -1.605509
H  3.865074 -1.422775 -0.941407
H  3.017204 -0.594243 -2.234952
