program: Gaussian 09
title: 000133624
version: EM64L-G09RevD.01
frameworkgroup: C1[X(C21H27N5O2S)]
method: RPBEPBE
basis: SDD
operation: Freq
keyword: #p
keyword: freq=noraman
keyword: PBEPBE/SDD
title: #p freq=noraman PBEPBE/SDD
converged: YES YES NO NO
title: Mulliken charges:
elementType: S O O N N N N N C C C C C C C C C C C C C C C C C C C C C H H H H H H H H H H H H H H H H H H H H H H H H H H H
charge: 0.945895 -0.470909 -0.444663 -0.357218 -0.022446 -0.153714 -0.104883 -0.046226 -0.576117 0.560096 0.707220 -0.243471 -0.244194 0.608682 -0.671843 -0.635964 -0.276148 -0.711556 -0.693130 -0.699076 -0.698452 -0.691858 -0.689292 0.139849 0.122212 -0.264560 -0.180077 -0.350395 -0.162908 0.264415 0.276892 0.249209 0.251701 0.218892 0.224487 0.231046 0.202506 0.203494 0.217270 0.282641 0.206844 0.222775 0.239004 0.243194 0.218237 0.207297 0.229515 0.219926 0.213215 0.211823 0.218758 0.233435 0.281166 0.246415 0.254245 0.236743
chargesum: 0.00000
title: Mulliken charges with hydrogens summed into heavy atoms:
elementType: S O O N N N N N C C C C C C C C C C C C C C C C C C C C C
charge: 0.945895 -0.470909 -0.444663 -0.357218 -0.022446 -0.153714 -0.104883 -0.046226 -0.576117 0.560096 0.707220 0.020944 0.032698 0.608682 -0.422634 -0.384263 -0.057256 -0.053517 0.010275 -0.030452 -0.029724 -0.029202 -0.025276 0.139849 0.122212 0.016606 0.066339 -0.096150 0.073835
polarizability: 4.24016695e+02 2.48737961e+01 2.80368559e+02 1.49219938e-02 1.76331042e+01 2.53036167e+02
1716.lowfreq: -16.7169 -4.2243 -0.0017 -0.0015 -0.0010 1.2704 9.8941 17.4443 18.8408
frequency: -13.5121 17.3339 18.7871 24.6579 39.8949 49.0755 52.4482 66.2510 75.9614 88.9777 105.3853 120.1335 126.3625 128.3031 145.5992 158.3191 165.6721 174.1132 183.7263 193.2257 209.6189 215.0831 221.4041 227.4203 230.8267 239.8171 242.0545 254.3607 257.0323 286.2566 291.4676 310.2178 324.7357 334.4049 351.7291 357.9686 375.7790 404.5691 411.7261 425.1905 433.7239 455.3863 465.8895 503.9131 507.1950 562.1110 578.0737 609.7915 614.3713 629.7159 653.5264 657.6185 698.3699 703.2725 746.9219 747.7917 798.6133 809.5527 828.9792 836.9069 873.2840 882.0809 892.3266 899.8139 907.7507 909.9851 919.3493 922.4144 925.3926 926.5515 938.5195 951.3087 956.2061 959.2177 962.5068 963.1991 966.4944 967.1033 968.2499 993.1096 1008.4973 1034.1784 1057.0747 1078.5470 1083.0818 1091.3159 1104.9219 1109.8910 1114.2270 1117.9949 1137.1349 1150.0290 1159.8880 1164.8911 1174.5249 1196.9187 1227.2000 1249.5374 1271.7351 1283.9495 1291.3204 1304.7244 1315.1697 1316.9843 1322.3309 1330.4266 1340.2714 1376.5742 1377.6431 1383.7389 1391.9117 1396.1122 1397.4798 1402.9393 1406.3556 1421.5348 1423.9274 1434.8376 1462.6543 1466.9916 1467.3384 1467.5062 1468.0712 1470.1101 1477.5350 1479.4115 1485.1437 1487.2264 1489.3722 1491.4370 1512.8021 1561.2674 1573.0641 1581.4739 1585.4043 2976.5368 2976.6996 2978.0091 2978.8890 2979.4970 2980.4946 2986.4399 3028.8964 3046.6830 3068.6788 3070.2165 3070.7059 3077.6257 3077.9222 3081.0505 3081.8621 3081.9318 3082.6058 3085.1997 3090.0213 3097.1925 3134.5961 3139.5290 3146.6017 3150.6508 3168.9292 3180.3303
redmass: 2.7032 6.0513 4.6217 3.7797 5.2389 4.0689 2.6821 6.5214 4.4932 2.9000 6.9985 3.5626 6.7283 3.2642 6.5653 4.4360 7.2515 2.9331 5.6196 4.6943 1.2412 1.2238 1.9761 1.6359 1.2075 2.4820 1.3099 1.2078 1.9306 5.9133 2.9114 2.9587 2.7503 7.0972 8.7189 3.9689 2.7936 3.5057 8.5549 3.4992 4.1553 7.1950 3.2202 3.7986 4.5680 3.0360 3.2828 3.0013 7.4064 3.7877 3.9010 12.6006 6.9112 7.0386 3.0369 1.9763 2.0936 3.7871 3.9464 8.3756 13.5909 2.6167 11.0196 1.4768 1.6766 1.3234 1.2412 1.9575 1.5369 1.2947 1.9769 8.4030 1.4670 2.1220 4.4672 2.1709 2.0248 1.4625 6.8165 12.0033 1.3490 2.4598 1.5227 1.6272 2.0289 4.9297 1.6879 2.5641 2.4515 2.8228 1.9059 5.6979 1.9651 1.0766 2.0470 1.7775 4.6376 1.5732 2.6718 1.3656 1.6979 1.3283 1.2636 1.7150 9.7508 3.4523 2.3306 1.1893 1.1899 1.2071 1.4401 1.2210 1.2380 1.2068 2.2015 1.9880 1.9896 1.8908 1.0504 1.0486 1.0462 1.0473 1.0458 1.0579 1.0492 1.0488 1.0656 1.0610 1.0511 1.0571 6.7794 5.9642 7.5708 4.8499 6.1211 1.0358 1.0349 1.0349 1.0364 1.0355 1.0356 1.0842 1.0832 1.0861 1.0994 1.1000 1.0998 1.0991 1.0982 1.1007 1.0998 1.1003 1.0973 1.1001 1.0997 1.1005 1.0902 1.0878 1.0900 1.0907 1.0956 1.1011
irintensity: 0.1308 1.7243 0.6520 0.4364 2.2215 1.7276 0.4244 1.3735 2.9993 0.3354 0.4142 0.1079 1.5140 0.0282 1.7843 0.6729 3.4437 3.2450 3.0647 2.0844 2.2116 1.2723 0.4075 1.7011 0.0883 1.7207 0.3999 0.2354 1.9018 2.4096 7.9104 1.3034 8.1240 59.8789 0.8192 5.7298 4.1338 3.3217 68.1970 26.6877 35.1043 6.0677 17.4310 3.1211 5.8600 3.7497 0.6735 2.8359 3.9580 0.1359 6.3803 1.9572 13.2733 16.8025 5.5568 28.5414 36.2022 0.9371 15.3051 53.5816 27.4895 0.6826 35.2082 5.5620 11.9539 1.1741 2.9128 3.7010 3.6690 4.1634 28.5271 15.6092 0.0124 13.2356 13.6458 10.7902 19.4161 0.9609 7.2250 22.5097 0.3263 1.8444 16.2572 18.2426 8.3432 12.3460 13.2283 0.9040 20.6919 2.1626 14.3348 14.4544 10.3244 1.5495 17.2141 6.4311 51.9586 7.5597 12.5192 2.3217 15.7044 0.3980 1.0844 3.7215 1.0713 10.7346 1.1304 5.4507 28.8464 12.2737 6.0322 15.4834 9.1819 11.2127 38.7142 0.9719 47.5060 17.1742 2.6227 6.7322 2.3806 3.2967 2.7544 6.2110 6.8506 19.4476 37.9474 0.3068 9.3763 11.2717 29.1603 3.2351 29.5336 28.4313 10.4903 18.8865 26.9423 26.1453 46.3533 24.2512 32.2618 17.2008 4.9590 23.0096 4.1821 2.6573 0.9375 98.9289 56.5309 17.8711 37.5600 14.6313 39.2403 34.6317 23.9112 7.7362 10.5162 4.3023 7.7391 10.6582 17.1049 15.3958
temp: 298.150 k
press: 1.00000 atm
elementType: 16 8 8 7 7 7 7 7 6 6 6 6 6 6 6 6 6 6 6 6 6 6 6 6 6 6 6 6 6 1 1 1 1 1 1 1 1 1 1 1 1 1 1 1 1 1 1 1 1 1 1 1 1 1 1 1
symmnumber: 1
zpe: 1167716.2 jmol-1
zpe.correction: 0.444760 hartree
zpe.thermalcorrener: 0.474817 hartree
zpe.thermalcorrenthalpy: 0.475761 hartree
zpe.thermalcorrgfe: 0.382531 hartree
zpe.sumelectzpe: -1636.315902 hartree
zpe.sumelectthermal: -1636.285845 hartree
zpe.sumelectthermalent: -1636.284900 hartree
zpe.sumelectthermalfe: -1636.378130 hartree
dipole: 1.8869 -5.1373 -2.1121
dipole: 5.8663
quadrupole: -133.2979 -179.7848 -199.6930
quadrupole: 10.4816 6.9184 -3.3774
quadrupole: 37.6274 -8.8596 -28.7678 10.4816 6.9184 -3.3774
hfenergy: -1636.7606612 hartree
pointgroup: C01 [X(C21H27N5O2S1)]
dipole: -0.8653494 -1.7345274 1.2527466 debye
polarizability: 418.5338912|-38.062773|277.6811073|-1.3213423|-20.9284642|261.2064227 unknown
InChI: InChI=1S/C15H23O2S.C6H4N5/c1-9(2)12-7-13(10(3)4)15(18(16)17)14(8-12)11(5)6;1-2-4-7-5(3-1)6-8-10-11-9-6/h7-11H,1-6H3;1-4H
charge 0 multiplicity 1
56 atoms
S  0.458929 1.537648 0.981619
O  0.595282 3.136281 0.802809
O  1.099365 0.893822 2.314325
N  1.426424 0.858792 -0.77999
N  0.696587 1.316313 -1.877619
N  2.6544 0.422885 -2.59195
N  1.442411 1.044626 -2.977136
N  3.321255 -0.571092 0.892106
C  -1.275916 0.796015 0.623112
C  -2.376028 1.667513 0.396571
C  -1.331492 -0.623758 0.648349
C  -2.327285 3.197244 0.273295
C  -0.145492 -1.579142 0.857229
C  -3.767475 -0.394187 0.242429
C  -3.62174 1.008902 0.217584
C  -2.616706 -1.185124 0.457102
C  -5.139941 -1.036223 0.032988
C  -3.573857 3.900342 0.862443
C  -2.12411 3.580048 -1.22172
C  -0.003002 -2.555003 -0.341125
C  -0.294422 -2.344342 2.199744
C  -5.589779 -1.830622 1.289152
C  -5.15684 -1.940496 -1.228814
C  2.622205 0.321669 -1.231204
C  3.666556 -0.28217 -0.401431
C  4.952907 -0.544387 -0.937908
C  5.925055 -1.116819 -0.09184
C  4.274324 -1.115572 1.696705
C  5.586241 -1.40424 1.252041
H  -1.447682 3.575277 0.821647
H  0.8026 -1.021363 0.928943
H  -4.508077 1.628937 0.048603
H  -2.704979 -2.2769 0.473986
H  -5.871699 -0.21971 -0.128153
H  -3.776776 3.577912 1.899927
H  -3.399863 4.991425 0.871203
H  -4.483069 3.724684 0.258143
H  -2.989225 3.252927 -1.829184
H  -2.030181 4.677124 -1.31643
H  -1.214231 3.114282 -1.635797
H  -0.874199 -3.229218 -0.434809
H  0.894094 -3.184566 -0.198544
H  0.109248 -2.008345 -1.294523
H  -0.313373 -1.641688 3.050994
H  0.565298 -3.025421 2.336619
H  -1.218298 -2.951753 2.225143
H  -5.611313 -1.186723 2.186546
H  -6.601968 -2.248058 1.137163
H  -4.904384 -2.674199 1.492803
H  -4.46393 -2.794809 -1.115774
H  -6.170426 -2.348963 -1.394799
H  -4.857009 -1.378177 -2.130943
H  5.158978 -0.295184 -1.982556
H  6.929649 -1.330266 -0.470828
H  3.965853 -1.321721 2.727278
H  6.315707 -1.841726 1.940377
