program: Gaussian 09
title: 000133621
version: EM64L-G09RevD.01
frameworkgroup: C1[X(C14H16N2O2)]
method: RPBEPBE
basis: SDD
operation: Freq
keyword: #p
keyword: freq=noraman
keyword: PBEPBE/SDD
title: #p freq=noraman PBEPBE/SDD
converged: YES YES NO NO
title: Mulliken charges:
elementType: O O N N C C C C C C C C C C C C C C H H H H H H H H H H H H H H H H
charge: -0.265410 -0.260983 -0.169194 -0.091976 -0.015644 -0.533140 -0.337308 0.237255 0.229485 -0.367212 0.241768 -0.212313 -0.345820 -0.368220 -0.376183 -0.649902 -0.225263 -0.225964 0.227624 0.204049 0.264728 0.219473 0.225882 0.216246 0.232841 0.252527 0.251610 0.256047 0.247781 0.234640 0.222051 0.224141 0.228363 0.228018
chargesum: 0.00000
title: Mulliken charges with hydrogens summed into heavy atoms:
elementType: O O N N C C C C C C C C C C C C C C
charge: -0.265410 -0.260983 -0.169194 -0.091976 0.211981 -0.064363 0.108046 0.237255 0.229485 0.081875 0.241768 0.040215 -0.094210 -0.112172 -0.128403 0.030931 0.003100 0.002054
polarizability: 2.03414916e+02 -1.13523521e+00 1.72396986e+02 7.35492603e+00 -9.73348057e-01 1.16618366e+02
1716.lowfreq: -8.3942 -0.0006 -0.0004 0.0007 0.4843 10.2084 20.3640 38.6194 42.8815
frequency: 19.8088 38.5954 42.8708 46.1344 95.3940 128.2913 143.9091 179.7401 201.9944 224.2338 251.1323 289.9007 295.9237 363.4004 384.1465 414.0081 445.0459 449.6274 469.0663 484.8787 544.1890 563.9031 627.0888 634.4058 641.1392 694.9243 712.1745 713.1651 737.8758 751.5576 755.2603 790.7233 796.5224 844.0313 849.1535 866.2175 896.2574 899.8144 933.7863 959.1407 967.2315 974.3879 1021.7511 1029.5709 1047.1143 1059.8653 1072.4206 1083.4866 1086.4891 1107.9748 1125.6681 1160.3922 1161.0591 1181.5195 1204.4970 1217.8703 1237.2122 1250.6728 1265.5243 1271.3207 1281.5288 1330.7254 1339.9574 1341.4168 1358.3798 1366.4867 1390.4576 1393.0896 1403.5373 1435.7435 1442.6496 1457.4389 1465.5957 1469.2218 1473.6492 1480.2783 1491.1679 1500.6553 1591.0858 1612.4024 2971.4365 2982.5239 2990.1821 2994.8758 3017.0437 3068.0227 3077.1687 3090.3004 3092.0119 3100.5270 3137.0029 3151.0109 3163.7623 3175.3019 3219.7927 3248.1444
redmass: 4.3877 4.5212 2.5262 4.9057 4.8889 4.2134 3.0100 3.3852 1.5179 2.9636 3.4864 5.0880 2.2396 3.4925 3.1511 2.7102 3.7857 3.2104 4.2696 5.6928 4.5858 4.8403 4.0483 4.0534 3.1318 4.6069 4.4104 4.6958 1.4280 3.1040 1.2394 1.3737 3.3140 1.3762 1.3966 4.5907 3.2852 2.8496 1.3660 2.2832 1.2913 7.1764 2.1060 1.9166 2.0146 4.9532 2.6270 1.5474 1.8088 2.1133 2.3060 1.6014 1.3202 2.2694 1.4608 1.5034 2.2727 2.1398 1.3850 1.3693 1.4380 1.2643 1.5495 1.3876 1.6972 1.9019 5.4800 1.2829 2.6880 1.1091 2.1923 1.1992 1.2070 1.8063 2.6486 1.2450 1.3603 3.5797 7.5155 7.0893 1.0822 1.0657 1.0357 1.0654 1.0615 1.1010 1.0943 1.0999 1.1015 1.1019 1.0852 1.0899 1.0947 1.1005 1.0906 1.1089
irintensity: 0.7329 1.3710 0.4497 0.2306 5.8380 0.7144 2.8143 1.5352 0.9537 2.8704 0.7440 0.6305 2.0176 3.6301 3.5343 4.8439 11.6098 5.0321 0.7247 5.5355 0.2789 2.9476 4.0632 2.0742 2.0860 7.3095 0.1472 3.6783 80.5651 7.1305 107.5451 1.0543 24.2287 9.5176 0.0084 34.5393 1.9075 3.1295 4.9812 7.3129 0.0160 34.8760 8.4075 9.4411 7.5342 51.0927 11.3496 1.1954 13.4398 25.9306 6.5882 4.6297 13.0015 3.6841 2.7533 57.7960 199.4897 42.1863 6.2517 23.1038 15.0596 19.9340 2.9623 11.4155 13.7607 1.4372 21.0278 24.8300 27.8502 12.3898 6.1410 14.3517 12.7191 8.5403 173.9123 1.8939 24.8554 6.5673 23.0999 5.6618 36.4652 25.7748 18.1494 60.9767 29.3602 4.0224 4.0419 39.1989 29.4535 36.6038 1.6181 13.7882 13.2792 14.1162 2.3548 6.7815
temp: 298.150 k
press: 1.00000 atm
elementType: 8 8 7 7 6 6 6 6 6 6 6 6 6 6 6 6 6 6 1 1 1 1 1 1 1 1 1 1 1 1 1 1 1 1
symmnumber: 1
zpe: 722604.5 jmol-1
zpe.correction: 0.275226 hartree
zpe.thermalcorrener: 0.291176 hartree
zpe.thermalcorrenthalpy: 0.292120 hartree
zpe.thermalcorrgfe: 0.229796 hartree
zpe.sumelectzpe: -801.693882 hartree
zpe.sumelectthermal: -801.677931 hartree
zpe.sumelectthermalent: -801.676987 hartree
zpe.sumelectthermalfe: -801.739311 hartree
dipole: 2.3841 -3.4933 -2.3144
dipole: 4.8211
quadrupole: -96.3427 -103.7181 -106.6552
quadrupole: -9.7495 -7.7303 -5.8565
quadrupole: 5.8960 -1.4794 -4.4166 -9.7495 -7.7303 -5.8565
hfenergy: -801.9691071 hartree
pointgroup: C01 [X(C14H16N2O2)]
dipole: -0.9591521 1.4244986 -0.8053561 debye
polarizability: 203.2259953|-0.3411695|172.0130456|-8.5148046|4.6119928|117.1912268 unknown
InChI: InChI=1S/C14H16N2O2/c1-2-16-8-7-15-14(16)9-11-10-17-12-5-3-4-6-13(12)18-11/h3-8,11H,2,9-10H2,1H3
charge 0 multiplicity 1
34 atoms
O  0.698843 -0.503672 0.519663
O  2.103198 2.058493 0.428627
N  -3.056415 -0.118105 -0.455282
N  -2.534395 -1.655362 1.130236
C  -0.019046 0.791614 0.559795
C  -1.332311 0.559051 1.333561
C  0.882484 1.841482 1.230767
C  -2.291853 -0.401138 0.687289
C  2.038306 -0.396823 0.075964
C  -3.186501 1.172507 -1.1605
C  2.720374 0.84958 0.01969
C  -3.817715 -1.264082 -0.733794
C  -3.48108 -2.196196 0.247824
C  2.69984 -1.579287 -0.313157
C  4.046404 0.910198 -0.45293
C  -4.380463 2.009655 -0.653878
C  4.03239 -1.519183 -0.774874
C  4.702425 -0.27345 -0.855051
H  -0.210597 1.105237 -0.487948
H  -1.811187 1.544839 1.503281
H  -1.084373 0.13334 2.321019
H  0.392091 2.827294 1.282175
H  1.160406 1.50425 2.249255
H  -2.246639 1.736794 -1.034124
H  -3.294274 0.968482 -2.241058
H  -4.499502 -1.309432 -1.579602
H  -3.850581 -3.211289 0.372364
H  2.152378 -2.525041 -0.252275
H  4.545296 1.883892 -0.487697
H  -5.329524 1.462318 -0.787728
H  -4.445675 2.960049 -1.213983
H  -4.27373 2.246153 0.419663
H  4.542246 -2.440088 -1.076155
H  5.733278 -0.223678 -1.220636
