program: Gaussian 09
title: 000133574
version: EM64L-G09RevD.01
frameworkgroup: C1[X(C15H13N3)]
method: RPBEPBE
basis: SDD
operation: Freq
keyword: #pfreq=noraman
keyword: PBEPBE/SDD
title: #p freq=noraman PBEPBE/SDD
converged: NO YES NO NO
title: Mulliken charges:
elementType: N N N C C C C C C C C C C C C C C C H H H H H H H H H H H H H
charge: -0.099188 -0.388215 -0.032470 0.213433 0.474480 0.312702 -0.562294 0.132872 -0.390748 -0.404126 -0.192853 -0.355070 -0.329659 -0.811888 -0.228700 -0.241873 -0.227184 -0.140094 0.269265 0.257054 0.235237 0.228595 0.269134 0.252511 0.226927 0.240276 0.226366 0.232551 0.235204 0.233946 0.363810
chargesum: 0.00000
title: Mulliken charges with hydrogens summed into heavy atoms:
elementType: N N N C C C C C C C C C C C C C C C
charge: -0.099188 -0.024405 -0.032470 0.213433 0.474480 0.312702 -0.293029 0.132872 -0.133694 -0.168890 0.035742 -0.085936 -0.077148 -0.118318 0.003851 -0.006669 0.006762 -0.140094
polarizability: 2.95639160e+02 -1.13178217e+01 1.68129973e+02 -4.19606767e+00 1.32585945e+00 1.21175564e+02
1716.lowfreq: -52.7960 -0.0004 -0.0002 0.0002 0.7983 5.2493 7.4509 30.8753 44.2214
frequency: -52.6095 30.7546 44.2133 52.0653 56.9736 99.3547 117.2205 169.8786 181.0530 208.2343 249.5303 260.2440 312.5258 363.8876 406.8243 420.7610 437.5349 467.7007 481.3660 510.2729 524.6716 546.9633 569.2403 614.1699 630.1302 642.3779 685.9735 698.6058 702.5558 723.1819 751.3756 786.6883 797.5067 854.6234 886.1876 906.5610 919.0171 937.6132 980.3084 983.3538 984.9444 989.8314 1000.9870 1003.4684 1017.8629 1046.3170 1050.1377 1088.8661 1090.7308 1133.3776 1174.2423 1175.9140 1176.3167 1195.4459 1247.5746 1296.5592 1312.9973 1324.1901 1365.2462 1384.6411 1399.9357 1412.3910 1433.4769 1437.7484 1471.0085 1472.4526 1477.7916 1487.8863 1582.9844 1588.1149 1598.4175 1612.9640 1624.8416 2194.0539 2977.6409 3059.0595 3086.0193 3120.6997 3125.6889 3131.9721 3143.8245 3145.7239 3155.4586 3165.9674 3167.5666 3174.2924 3438.1506
redmass: 1.0147 4.3955 4.2856 5.3773 5.6910 6.3156 5.6004 6.2372 4.5089 3.0843 5.2101 5.3512 3.5366 5.9319 2.8450 4.0156 2.9115 4.2636 5.2790 5.6558 6.7045 4.3629 1.6918 6.1443 4.8269 5.9480 4.2039 1.9372 2.0490 3.8362 5.9813 2.1378 1.5585 1.2456 1.3060 1.4542 2.7693 1.4439 1.3525 5.7422 1.4031 5.8957 1.5708 1.3384 3.6272 1.5772 2.6643 1.6244 1.5543 2.7746 1.6808 1.1369 1.2162 1.1154 3.8694 1.5198 3.1527 1.3548 6.3438 7.9636 1.2309 2.5607 1.5630 2.0695 1.5737 1.1472 1.3960 2.3827 5.9703 5.9552 5.9658 6.0617 6.6371 12.3207 1.0383 1.0956 1.0998 1.0911 1.0871 1.0854 1.0887 1.0931 1.0931 1.0959 1.0979 1.1008 1.0742
irintensity: 0.5242 1.0140 0.6611 0.7298 0.7138 5.2322 4.0160 6.0814 1.4362 4.1146 2.6309 1.8596 0.4587 3.6104 0.1830 7.0778 6.4644 5.8067 9.0809 2.8073 1.1258 0.8941 37.8018 1.3046 20.5190 7.0849 41.6726 48.4988 35.5083 22.9270 6.7399 28.8222 49.3507 1.6589 3.8187 4.0978 15.0311 3.1396 0.4864 1.5085 1.0913 1.0364 3.4367 0.7838 35.9174 14.0392 25.3810 9.6209 13.9437 41.9572 16.2091 0.8994 6.6320 8.7039 49.2493 20.6989 133.8333 3.1676 0.5698 1.7422 12.8938 2.3254 12.4254 31.6815 7.2819 14.6821 20.8853 44.0499 108.5981 20.6139 153.4926 5.9593 305.1992 199.7456 31.6116 18.7965 17.0813 6.9775 7.0002 0.1902 6.9622 24.9759 23.5832 15.1506 13.6289 13.9429 95.8699
temp: 298.150 k
press: 1.00000 atm
elementType: 7 7 7 6 6 6 6 6 6 6 6 6 6 6 6 6 6 6 1 1 1 1 1 1 1 1 1 1 1 1 1
symmnumber: 1
zpe: 632569.0 jmol-1
zpe.correction: 0.240933 hartree
zpe.thermalcorrener: 0.256189 hartree
zpe.thermalcorrenthalpy: 0.257133 hartree
zpe.thermalcorrgfe: 0.196844 hartree
zpe.sumelectzpe: -742.380431 hartree
zpe.sumelectthermal: -742.365174 hartree
zpe.sumelectthermalent: -742.364230 hartree
zpe.sumelectthermalfe: -742.424520 hartree
dipole: 1.6469 -1.9438 -0.0857
dipole: 2.5491
quadrupole: -83.8508 -119.5252 -101.4036
quadrupole: 10.7268 -0.3919 -0.7326
quadrupole: 17.7424 -17.9320 0.1896 10.7268 -0.3919 -0.7326
hfenergy: -742.6213634 hartree
pointgroup: C01 [X(C15H13N3)]
dipole: 0.6583534 -0.7546827 0.0528676 debye
polarizability: 296.0071841|-9.7345143|167.6139819|-0.1801902|-3.5318917|121.323531 unknown
InChI: InChI=1S/C15H13N3/c1-12-6-5-9-14(10-12)18-15(17-11-16)13-7-3-2-4-8-13/h2-10,17H,1H3
charge 0 multiplicity 1
31 atoms
N  0.320065 -0.936589 0.002478
N  -0.171189 1.300438 -0.678076
N  -1.466463 3.497247 -0.624956
C  1.725493 -0.733609 -0.087748
C  3.815473 0.356281 0.673161
C  -2.014554 -0.274661 0.016832
C  2.405046 0.23025 0.715853
C  -0.568878 0.002925 -0.201776
C  2.480971 -1.584438 -0.939116
C  4.548338 -0.482081 -0.207109
C  3.882283 -1.44354 -1.001761
C  -2.364094 -1.261317 0.978253
C  -3.04112 0.37032 -0.722711
C  4.529865 1.349702 1.574174
C  -3.715613 -1.583044 1.209442
C  -4.39424 0.041013 -0.49099
C  -4.736682 -0.929606 0.477544
C  -0.875415 2.452901 -0.639982
H  1.827648 0.854236 1.409816
H  1.956238 -2.340053 -1.531693
H  5.639544 -0.389093 -0.259265
H  4.459754 -2.092915 -1.669276
H  -1.559833 -1.766064 1.522233
H  -2.798921 1.109628 -1.49217
H  3.864881 2.175784 1.880847
H  4.889614 0.856209 2.497749
H  5.41135 1.787939 1.073294
H  -3.974999 -2.340073 1.957318
H  -5.178102 0.541528 -1.069072
H  -5.788387 -1.177885 0.6583
H  0.82243 1.369264 -0.935194
