program: Gaussian 09
title: 000133565
version: EM64L-G09RevD.01
frameworkgroup: C1[X(C9H21N3O3)]
method: RPBEPBE
basis: SDD
operation: Freq
keyword: #p
keyword: freq=noraman
keyword: PBEPBE/SDD
title: #p freq=noraman PBEPBE/SDD
converged: YES YES NO NO
title: Mulliken charges:
elementType: O O O N N N C C C C C C C C C H H H H H H H H H H H H H H H H H H H H H
charge: -0.292469 -0.473438 -0.432687 -0.276561 -0.326860 -0.571136 -0.391106 -0.345296 -0.363433 -0.350115 -0.399799 -0.378741 -0.369381 0.198208 -0.147265 0.216560 0.182309 0.200213 0.214660 0.178130 0.206295 0.170049 0.206018 0.259382 0.219238 0.233402 0.242675 0.167652 0.173446 0.205097 0.340571 0.273258 0.258617 0.222354 0.373178 0.376973
chargesum: 0.00000
title: Mulliken charges with hydrogens summed into heavy atoms:
elementType: O O O N N N C C C C C C C C C
charge: -0.292469 -0.100260 -0.055714 -0.043159 0.013712 -0.039261 0.007763 0.069578 0.020993 0.025952 0.078821 0.031586 0.009162 0.198208 0.075089
polarizability: 1.68425504e+02 3.14006187e-01 1.24094571e+02 9.44745801e+00 4.21361887e+00 1.03783992e+02
1716.lowfreq: -12.9155 -1.7107 -0.0007 -0.0004 0.0005 4.3230 9.8073 19.5588 34.2776
frequency: -11.7560 19.3519 34.1180 43.4980 56.7762 67.0046 83.2762 96.3680 124.7785 141.6412 144.1323 156.0675 185.4875 206.8411 238.8992 280.0389 295.6437 301.3453 318.2889 375.2990 433.1259 461.9910 469.4112 475.4935 508.3249 531.4073 588.0855 594.2515 646.9762 674.9530 744.9319 761.0771 770.9312 818.2208 865.5604 876.8044 905.4138 945.5225 956.4417 959.2267 1023.8517 1026.9216 1046.0959 1067.9023 1085.1555 1094.6686 1096.9949 1109.5930 1118.6101 1143.2504 1149.0524 1162.3522 1207.3019 1223.4186 1227.9452 1246.2434 1261.6417 1265.1986 1271.5651 1282.7839 1285.6069 1294.8157 1306.6185 1334.9131 1343.1785 1356.6693 1367.8599 1389.8442 1395.9359 1413.6195 1451.5874 1459.0671 1463.6755 1468.2743 1473.2531 1486.9953 1493.3179 1501.0856 1517.1489 1634.4174 1638.5459 2833.4295 2841.4754 2861.4542 2950.0659 2957.8648 2978.6237 2982.4766 2990.6295 2992.5175 2994.5463 3012.4084 3020.4875 3049.0146 3065.1540 3077.1926 3390.1350 3415.2218 3455.0388 3531.0051 3575.8286 3583.1681
redmass: 6.0925 4.9138 2.2480 3.0190 6.6368 5.0675 1.9324 2.8759 2.4739 3.5171 2.3202 2.5374 3.4218 3.2443 1.1968 3.6027 1.5879 2.5933 2.3696 3.0228 3.1407 2.3038 4.0479 1.7382 3.0789 3.0326 4.3403 1.2890 1.2103 1.3056 1.6321 2.0685 1.0851 1.8072 1.4749 1.4775 3.0379 2.4244 2.1800 3.8614 2.7138 4.0842 3.0180 2.8582 2.2808 1.7681 2.5745 2.5302 2.1341 1.4094 4.0711 1.1217 1.5340 1.3252 1.6340 1.3755 1.4468 1.2701 1.1657 1.1164 1.0904 1.1843 1.2664 1.1015 1.3438 1.4200 1.3717 1.4184 1.5480 1.5274 1.2118 1.0778 1.0937 1.0740 1.0847 1.0923 1.0902 1.0856 1.9916 7.6607 1.0945 1.0716 1.0712 1.0717 1.0690 1.0629 1.0610 1.0839 1.0849 1.0842 1.0656 1.0856 1.0977 1.1015 1.0955 1.1006 1.0641 1.0738 1.0448 1.0774 1.0660 1.0976
irintensity: 4.0156 1.0119 3.9590 2.4448 1.5922 3.2185 0.4553 0.4016 1.4194 0.5845 1.0991 3.7644 1.2172 15.3365 58.6122 0.9673 36.7638 27.6337 127.0709 7.1041 6.7229 26.6915 2.2613 132.7879 33.0972 6.9167 28.9276 200.0875 136.2740 99.7095 39.1803 13.1473 5.7832 2.1219 5.4299 7.4164 2.2134 40.8684 5.1346 148.0511 22.7249 63.0831 44.2200 27.1299 7.0348 19.1144 7.2533 28.8888 10.7360 18.8294 56.0261 48.1635 2.6663 0.9609 0.6433 9.9063 72.3228 17.1387 19.1380 6.5348 3.3169 11.3388 15.8235 12.3863 10.8776 6.5900 8.2585 26.1353 2.2759 157.9534 27.1880 5.6423 21.3893 2.1202 8.1807 9.3657 0.2931 4.3331 119.3622 226.0588 38.5571 44.6569 122.0023 185.5711 20.9401 18.1707 33.3560 61.4357 6.0556 64.9507 30.8608 54.5649 3.3397 91.4998 49.2587 9.0831 61.2629 2.7596 1.5246 42.5157 12.0277 0.1458
temp: 298.150 k
press: 1.00000 atm
elementType: 8 8 8 7 7 7 6 6 6 6 6 6 6 6 6 1 1 1 1 1 1 1 1 1 1 1 1 1 1 1 1 1 1 1 1 1
symmnumber: 1
zpe: 812872.8 jmol-1
zpe.correction: 0.309607 hartree
zpe.thermalcorrener: 0.327730 hartree
zpe.thermalcorrenthalpy: 0.328674 hartree
zpe.thermalcorrgfe: 0.260813 hartree
zpe.sumelectzpe: -744.216568 hartree
zpe.sumelectthermal: -744.198444 hartree
zpe.sumelectthermalent: -744.197500 hartree
zpe.sumelectthermalfe: -744.265362 hartree
dipole: 3.6926 1.1483 -0.4966
dipole: 3.8988
quadrupole: -108.8655 -84.5843 -98.2618
quadrupole: -1.6640 -19.2974 -2.6732
quadrupole: -11.6283 12.6529 -1.0246 -1.6640 -19.2974 -2.6732
hfenergy: -744.5261746 hartree
pointgroup: C01 [X(C9H21N3O3)]
dipole: 1.4609992 -0.4547207 0.1076799 debye
polarizability: 168.5649989|2.6625568|121.3184885|-8.6470046|8.0793308|106.4205798 unknown
InChI: InChI=1S/C9H21N3O3/c10-4-3-6-11-5-1-2-7-12-8(13)9(14)15/h9,11-12,14-15H,1-7,10H2
charge 0 multiplicity 1
36 atoms
O  -4.508371 0.592122 0.932931
O  -4.12774 -1.784788 -1.561802
O  -5.551139 -1.816046 0.395793
N  2.734857 0.259454 -0.202978
N  -2.695379 0.279411 -0.526773
N  7.444538 -1.327394 -0.35806
C  0.334989 0.913963 -0.311765
C  -0.81151 1.705494 0.35496
C  1.671114 1.056599 0.443216
C  4.066116 0.368899 0.434224
C  -2.146828 1.645111 -0.421639
C  5.098963 -0.517973 -0.286779
C  6.497502 -0.450891 0.360245
C  -3.809211 -0.128092 0.149199
C  -4.231594 -1.59732 -0.108045
H  0.483321 1.254808 -1.355459
H  0.062553 -0.162042 -0.359699
H  -0.520666 2.772338 0.440985
H  -0.979757 1.336363 1.385549
H  1.516157 0.786142 1.520707
H  1.986851 2.119496 0.430245
H  4.043902 0.103696 1.523868
H  4.385819 1.429087 0.375362
H  -2.911845 2.255545 0.088672
H  -2.008393 2.048696 -1.443492
H  2.45294 -0.727484 -0.300396
H  5.175072 -0.217289 -1.346686
H  4.745852 -1.573063 -0.27513
H  6.400373 -0.685053 1.450528
H  6.875534 0.587729 0.291181
H  -2.338216 -0.358748 -1.242968
H  8.426027 -1.202825 -0.092799
H  7.171923 -2.315723 -0.361986
H  -3.556546 -2.314654 0.402044
H  -4.53678 -2.656379 -1.795131
H  -5.901927 -0.929387 0.70378
