program: Gaussian 09
title: 000133558
version: EM64L-G09RevD.01
frameworkgroup: C1[X(C23H30O3)]
method: RPBEPBE
basis: SDD
operation: Freq
keyword: #pfreq=noraman
keyword: PBEPBE/SDD
title: #p freq=noraman PBEPBE/SDD
converged: NO YES NO NO
title: Mulliken charges:
elementType: O O O C C C C C C C C C C C C C C C C C C C C C C C H H H H H H H H H H H H H H H H H H H H H H H H H H H H H H
charge: -0.243194 -0.235649 -0.441327 0.387526 -0.156894 -0.142681 -0.111475 0.160782 -0.228293 -0.542827 -0.523666 -0.526960 -0.514516 -0.483808 -0.633292 0.543575 -0.643915 -0.465021 -0.785412 0.107456 -0.558216 -0.587210 0.178728 0.209167 -0.378845 -0.524998 0.220833 0.249750 0.217294 0.251282 0.231059 0.225542 0.211501 0.225172 0.229101 0.254303 0.239707 0.219019 0.235754 0.210734 0.252146 0.246998 0.225372 0.236032 0.213860 0.213346 0.225474 0.224983 0.234671 0.245914 0.230895 0.255484 0.240479 0.227142 0.282779 0.364340
chargesum: 0.00000
title: Mulliken charges with hydrogens summed into heavy atoms:
elementType: O O O C C C C C C C C C C C C C C C C C C C C C C C
charge: -0.243194 -0.235649 -0.076987 0.387526 0.063940 0.107069 0.105819 0.160782 0.022989 -0.086226 -0.086993 -0.043556 -0.055790 -0.037320 -0.134148 0.543575 -0.182511 -0.037815 -0.100285 0.107456 -0.081407 -0.331727 0.178728 0.209167 0.088776 -0.242219
polarizability: 3.09913875e+02 9.67536258e+00 2.27362837e+02 6.51582584e+00 1.25747520e+01 1.99854367e+02
1716.lowfreq: -14.4821 -7.8377 -6.8394 -0.0008 -0.0007 0.0005 17.3954 27.2235 39.3248
frequency: 16.8472 27.1417 39.1998 51.9961 55.8815 71.6555 95.7896 119.8403 145.0696 155.9904 159.7942 172.4198 187.1379 196.1964 215.2998 220.3303 235.2456 244.3499 260.3600 277.4183 289.0169 309.9960 316.1629 341.4570 347.2970 358.0652 364.8727 381.7535 388.9069 416.3677 418.5654 439.1746 454.0760 483.6227 494.6852 527.6204 537.7770 551.1483 552.6540 571.6129 608.9819 629.4543 635.4018 640.0538 650.1577 678.1347 690.1941 721.2897 768.9442 781.2764 812.6920 829.3133 837.7914 841.6158 849.3540 876.6914 880.7891 890.3679 908.2277 917.8104 920.3469 944.3199 954.9013 960.0405 970.5896 972.2965 995.4980 996.1004 1010.9227 1028.0357 1036.3719 1049.6266 1050.3197 1063.9345 1074.7566 1080.2277 1091.8828 1104.4495 1115.0014 1117.7272 1127.1372 1135.6636 1143.6655 1156.4188 1171.0078 1177.7015 1183.6105 1186.2152 1198.9128 1202.3953 1223.0877 1228.4423 1237.4691 1239.8903 1247.8764 1249.1565 1256.1986 1276.9196 1286.7707 1291.9521 1298.0113 1306.8432 1308.6165 1319.0317 1323.8627 1325.9213 1334.1088 1338.8419 1346.8628 1350.0602 1354.4123 1358.8061 1359.5668 1364.7556 1386.7597 1388.5107 1438.5540 1443.1939 1450.1401 1453.9117 1463.4967 1466.0515 1470.5470 1473.1799 1477.7518 1479.9794 1485.6090 1498.4132 1584.2949 1605.1964 1623.6900 2134.1581 2925.1760 2934.5716 2944.9542 2956.1253 2963.7300 2972.1097 2976.1879 2978.8718 2983.3145 2986.3946 2986.7704 2990.0419 2991.8393 2997.9761 3004.5568 3010.5179 3023.8773 3036.9703 3039.2781 3040.8010 3042.4299 3052.0350 3057.7202 3063.3055 3073.2391 3077.3185 3081.3591 3119.5043 3409.6251 3424.0040
redmass: 6.3111 6.5679 6.1076 4.2521 4.7270 4.6091 3.4325 3.8357 3.7513 3.1165 3.2057 1.2839 3.5952 3.5244 2.5399 3.2285 2.6815 2.9853 2.4080 3.1791 2.8905 3.0423 3.3646 3.3331 2.2852 4.2896 2.2642 3.4006 2.8052 3.0968 1.8175 2.3893 2.5627 3.7002 3.9458 2.7154 2.6357 2.3642 2.8088 2.7731 2.4956 3.2508 1.2324 2.8496 1.3564 3.2703 2.9838 3.8255 2.1157 3.3410 2.2184 2.2278 2.7433 2.7135 2.1006 1.9526 2.1964 1.7125 2.1890 2.3761 1.9845 2.0671 2.1821 2.2651 2.4446 2.2345 2.5004 2.0610 3.4990 1.8687 2.4913 1.8965 2.6414 2.2967 2.5757 2.3337 2.6162 2.1034 1.9484 2.3979 1.9962 2.0574 2.0012 1.7680 1.4424 1.2491 1.3489 1.5617 2.0830 1.4196 1.3142 1.3842 1.5419 1.4096 1.3552 1.3952 1.3904 2.0313 1.3691 1.3561 1.4839 1.3982 1.4093 1.3095 1.4354 1.2864 1.3945 1.5346 1.7619 1.4181 1.3955 1.4529 1.4503 1.3405 1.4441 1.2060 1.0762 1.0784 1.0848 1.0860 1.0834 1.0830 1.0882 1.0683 1.0930 1.0775 1.0631 1.0728 9.9942 6.4755 7.7443 6.0440 1.0816 1.0818 1.0618 1.0665 1.0676 1.0638 1.0666 1.0673 1.0632 1.0499 1.0678 1.0771 1.0661 1.0642 1.0640 1.0792 1.0996 1.0984 1.0937 1.0974 1.0991 1.1006 1.1001 1.0960 1.1045 1.0986 1.0991 1.0911 1.0640 1.1584
irintensity: 1.4723 0.3418 2.7455 1.0646 1.2994 1.1528 6.7355 0.3697 0.8034 4.4505 0.5917 0.8304 0.6024 0.8190 2.0799 0.4079 1.4799 0.6447 4.0990 5.5051 3.0719 0.9126 0.9816 15.0710 9.1526 6.2872 0.2330 1.0417 26.0512 3.3029 41.7156 17.2097 30.8622 1.0691 4.2244 0.2265 9.1480 0.2497 3.5269 7.6545 0.9729 2.4778 70.5731 3.9574 70.5773 6.9609 2.6405 6.4437 6.2746 0.7787 2.1709 3.0485 1.0873 3.4867 1.6062 22.4699 18.7855 14.5751 5.6313 4.0102 4.8187 15.8312 4.5457 8.6623 6.1422 4.3902 0.8374 3.2127 93.9974 11.7998 54.8641 2.6457 6.0759 2.9895 5.6623 10.1675 4.8731 1.6846 15.5234 5.2113 4.3961 0.1928 1.0872 2.7456 3.4210 9.2602 3.6018 16.6328 8.6647 0.9783 9.7547 30.9853 8.1791 18.5863 16.6847 75.3758 5.1466 34.4845 4.1323 5.8391 5.0360 1.3545 13.3420 4.2112 8.9537 3.8985 2.3248 6.1047 5.0983 0.1750 0.0499 38.0952 48.5333 1.7973 19.5228 23.7901 20.3458 16.6456 5.8996 23.4964 10.1417 11.6979 6.2138 0.0409 15.4920 10.2379 8.7894 13.9734 171.5963 47.5027 195.9755 6.3360 11.9836 16.0268 34.5282 12.2647 14.6997 19.1542 7.9045 33.4881 19.5695 8.3536 67.4632 8.0835 22.1115 28.4863 39.9363 18.5352 21.0950 1.3549 44.8265 33.8009 40.2656 46.3880 24.3994 21.5132 30.7628 29.3573 27.6048 10.6414 24.5281 75.4780
temp: 298.150 k
press: 1.00000 atm
elementType: 8 8 8 6 6 6 6 6 6 6 6 6 6 6 6 6 6 6 6 6 6 6 6 6 6 6 1 1 1 1 1 1 1 1 1 1 1 1 1 1 1 1 1 1 1 1 1 1 1 1 1 1 1 1 1 1
symmnumber: 1
zpe: 1249241.8 jmol-1
zpe.correction: 0.475811 hartree
zpe.thermalcorrener: 0.500779 hartree
zpe.thermalcorrenthalpy: 0.501724 hartree
zpe.thermalcorrgfe: 0.421276 hartree
zpe.sumelectzpe: -1118.071128 hartree
zpe.sumelectthermal: -1118.046160 hartree
zpe.sumelectthermalent: -1118.045216 hartree
zpe.sumelectthermalfe: -1118.125663 hartree
dipole: 4.3525 0.5637 -2.5291
dipole: 5.0654
quadrupole: -206.6311 -152.9314 -161.0943
quadrupole: 9.1678 -16.5548 6.4393
quadrupole: -33.0788 20.6209 12.4580 9.1678 -16.5548 6.4393
hfenergy: -1118.5469393 hartree
pointgroup: C01 [X(C23H30O3)]
dipole: -1.6769889 0.0552813 1.0752734 debye
polarizability: 309.8603706|-11.7449298|231.179964|0.7890244|-6.4917882|196.090744 unknown
InChI: InChI=1S/C23H30O3/c1-3-10-23-12-9-18-17(19(23)6-7-20(23)21(26)14-24)5-4-15-13-16(25)8-11-22(15,18)2/h1,13,17-20,24H,4-12,14H2,2H3
charge 0 multiplicity 1
56 atoms
O  -2.935683 -1.709737 -1.503945
O  6.65627 0.328158 -0.167524
O  -4.574169 -0.342846 -3.125984
C  -1.908129 0.352092 0.793593
C  -0.946422 -0.805894 1.285525
C  0.304889 -0.997079 0.385033
C  1.087084 0.340435 0.236312
C  2.386064 0.210799 -0.661494
C  -3.310054 -0.350882 0.52222
C  -1.314077 1.088514 -0.434962
C  0.153628 1.520827 -0.206496
C  -1.821719 -2.090717 1.398795
C  -3.284771 -1.595346 1.456085
C  1.233597 -2.082491 0.973978
C  -2.111906 1.362985 1.982618
C  3.232487 -0.969694 -0.153251
C  2.505324 -2.274304 0.113064
C  3.199993 1.537462 -0.534264
C  2.026378 -0.061239 -2.156971
C  -3.518399 -0.7400 -0.931899
C  4.650967 1.431376 -1.045879
C  4.591884 -0.885235 0.016967
C  5.401588 0.291289 -0.359069
C  -3.020875 2.484691 1.69069
C  -4.507398 0.091306 -1.750047
C  -3.786115 3.420691 1.443516
H  -0.572588 -0.53414 2.296978
H  -0.044852 -1.34173 -0.610585
H  1.465866 0.575181 1.257289
H  -4.121718 0.351888 0.791879
H  -1.926341 1.979577 -0.674783
H  -1.353158 0.424159 -1.318211
H  0.519227 1.979631 -1.142871
H  0.189544 2.329813 0.547298
H  -1.5579 -2.707214 2.276594
H  -1.686674 -2.710053 0.494015
H  -4.006004 -2.372318 1.146601
H  -3.55747 -1.282763 2.482274
H  0.698733 -3.047231 1.052181
H  1.526478 -1.78846 2.003618
H  -1.124314 1.765935 2.279714
H  -2.492423 0.809129 2.863694
H  2.199947 -2.716985 -0.85926
H  3.19193 -2.999646 0.586333
H  3.227919 1.828113 0.535879
H  2.677186 2.349919 -1.072493
H  1.467329 -1.004267 -2.284662
H  1.407809 0.7547 -2.571695
H  2.940445 -0.133794 -2.772518
H  5.208303 2.370917 -0.884344
H  4.66948 1.237274 -2.137932
H  5.156428 -1.741931 0.408265
H  -4.206123 1.158644 -1.6985
H  -5.507031 0.010877 -1.268801
H  -4.446835 4.243588 1.239596
H  -3.983227 -1.146974 -3.197862
