program: Gaussian 09
title: 000133538
version: EM64L-G09RevD.01
frameworkgroup: C1[X(C18H20ClNO2)]
method: RPBEPBE
basis: SDD
operation: Freq
keyword: #p
keyword: freq=noraman
keyword: PBEPBE/SDD
title: #p freq=noraman PBEPBE/SDD
converged: YES YES NO NO
title: Mulliken charges:
elementType: Cl O O N C C C C C C C C C C C C C C C C C C H H H H H H H H H H H H H H H H H H H H
charge: -0.084775 -0.428816 -0.459380 -0.060631 -0.299646 -0.440211 0.328745 -0.361231 -0.573403 0.447070 0.434472 -0.509019 -0.635242 -0.520688 -0.584098 -0.379754 0.138431 0.197467 0.435600 -0.245156 -0.404861 -0.815677 0.221621 0.227402 0.195808 0.196404 0.209793 0.235946 0.226773 0.285110 0.224290 0.190939 0.228164 0.237771 0.241363 0.223773 0.231213 0.225854 0.237239 0.222686 0.384640 0.374013
chargesum: 0.00000
title: Mulliken charges with hydrogens summed into heavy atoms:
elementType: Cl O O N C C C C C C C C C C C C C C C C C C
charge: -0.084775 -0.044176 -0.085367 -0.060631 -0.078025 -0.017001 0.328745 0.044966 -0.110684 0.447070 0.434472 -0.223909 0.008151 -0.520688 -0.346328 -0.138390 0.138431 0.197467 0.435600 -0.021383 -0.173647 -0.129897
polarizability: 2.73341257e+02 -1.41751726e+01 2.18378221e+02 -8.71018150e+00 1.04563507e+01 1.65646378e+02
1716.lowfreq: -36.4203 -8.6934 -7.4866 -1.7650 -0.0012 -0.0011 -0.0010 21.6364 34.9382
frequency: -36.3736 21.5652 34.9276 60.2096 66.5081 89.6291 120.3707 149.6486 155.0225 191.5607 197.9020 205.3582 222.5999 229.9853 235.9100 262.9895 280.2736 289.7397 306.0078 330.7429 351.8413 364.7658 378.8919 394.0842 407.8529 430.9249 461.4083 464.0542 473.0455 503.0083 512.5737 525.6785 559.1277 585.3523 596.4935 649.7876 659.6297 686.3676 712.3923 736.3959 744.6686 782.1054 808.5328 810.0409 853.3955 892.2906 899.0235 912.7805 919.8284 936.8952 946.9729 982.6924 989.0421 991.6660 993.5295 1027.0856 1047.5604 1050.8008 1061.0993 1081.8566 1099.6004 1112.2254 1123.4704 1132.3962 1171.4571 1173.5145 1184.8293 1185.8617 1197.5605 1208.8560 1225.6532 1253.6816 1259.6691 1278.7992 1291.2455 1309.4039 1317.7073 1319.7265 1351.1432 1352.4904 1374.4519 1377.3514 1389.9075 1397.0240 1429.1217 1429.9450 1432.0083 1457.2677 1463.2825 1466.5472 1471.9198 1472.9644 1475.9166 1484.6258 1485.2508 1490.8406 1586.5499 1596.8673 1616.2772 1629.8590 2846.3111 2850.5425 2869.2107 2974.9710 2976.0408 2989.7743 3017.2137 3018.4497 3034.5513 3056.1968 3070.6888 3077.3572 3084.0943 3109.2042 3117.9186 3130.2674 3152.1317 3179.3634 3528.3268 3530.9896
redmass: 1.0111 4.2337 6.8342 4.3250 4.7483 3.2290 7.9613 3.7379 3.2742 5.0471 4.0710 3.1409 2.4257 2.0377 4.0191 4.4338 4.0432 5.4197 3.5815 2.4242 2.6846 2.6453 5.9957 1.1264 4.6277 3.0825 2.9703 4.1607 1.1680 3.8720 5.0999 4.4036 4.3248 3.0099 4.1709 6.0975 5.7111 5.2519 2.2430 4.0937 3.8000 2.2611 4.0102 2.3823 4.4611 1.4251 1.3675 2.1707 1.6840 2.1927 2.5526 1.3776 3.3925 2.0445 2.1317 2.0431 1.5767 2.7528 2.4400 3.1615 1.6879 1.3877 2.7044 2.4069 1.4025 1.5568 1.1664 1.2179 1.3569 1.6933 1.4221 2.6522 2.0527 2.3091 1.4933 1.4397 1.3409 1.3178 1.6500 1.8241 1.6221 4.7424 3.7094 1.2261 2.5845 2.6771 1.2255 1.0783 1.0527 1.1422 1.3762 1.0617 1.1353 1.4649 1.1939 4.9621 6.8756 5.7006 6.2506 7.6881 1.0713 1.0655 1.0601 1.0385 1.0817 1.0653 1.0877 1.0742 1.0891 1.0953 1.0947 1.1007 1.0998 1.0911 1.0858 1.0915 1.0992 1.0911 1.0650 1.0651
irintensity: 0.5402 0.2358 0.0456 0.4503 0.4936 0.5670 0.3865 1.8697 0.2095 1.5640 0.4991 1.3536 1.2049 1.4303 2.2763 5.7234 2.6464 5.2348 4.3513 2.4996 3.2064 2.0556 4.3198 174.6140 4.4010 3.4889 3.9522 8.2305 110.7023 4.3175 3.3294 5.6158 10.7195 11.6540 15.4251 5.5112 12.5317 12.8093 22.6352 11.2511 7.4959 21.3704 9.0788 49.6777 28.0913 7.8360 6.5832 2.1501 2.6575 18.5707 15.9513 0.8597 0.8014 6.5463 3.2676 14.9214 11.8221 16.4650 8.2264 53.5124 9.8471 4.2222 124.7869 15.1961 52.0130 8.0623 15.1216 52.9807 38.7215 19.1066 11.7978 197.5821 46.1211 18.4556 22.8912 18.7189 10.7263 3.8990 9.0556 15.2980 17.7178 1.8611 4.3676 12.2266 33.9651 28.1800 0.4778 0.8800 27.2535 24.4617 10.8758 11.8106 10.4975 32.8264 0.8723 89.9538 68.1985 5.6858 30.7629 11.1379 42.2905 50.1171 203.0158 33.9254 15.4391 14.9692 29.9069 66.9703 36.0096 22.6271 13.3623 36.5623 18.0152 14.7122 3.1348 30.2747 23.1230 2.6998 91.5627 64.4864
temp: 298.150 k
press: 1.00000 atm
elementType: 17 8 8 7 6 6 6 6 6 6 6 6 6 6 6 6 6 6 6 6 6 6 1 1 1 1 1 1 1 1 1 1 1 1 1 1 1 1 1 1 1 1
symmnumber: 1
zpe: 887194.7 jmol-1
zpe.correction: 0.337915 hartree
zpe.thermalcorrener: 0.358095 hartree
zpe.thermalcorrenthalpy: 0.359040 hartree
zpe.thermalcorrgfe: 0.289084 hartree
zpe.sumelectzpe: -1361.550165 hartree
zpe.sumelectthermal: -1361.529984 hartree
zpe.sumelectthermalent: -1361.529040 hartree
zpe.sumelectthermalfe: -1361.598996 hartree
dipole: -0.2806 1.3008 0.1139
dipole: 1.3356
quadrupole: -124.3036 -134.8480 -134.1591
quadrupole: -0.4051 1.0761 -3.9111
quadrupole: 6.7999 -3.7444 -3.0556 -0.4051 1.0761 -3.9111
hfenergy: -1361.8880797 hartree
pointgroup: C01 [X(C18H20Cl1N1O2)]
dipole: 0.1143902 0.5087567 -0.0648488 debye
polarizability: 273.462106|13.2795166|217.2755289|-9.974366|-12.4233418|166.6282217 unknown
InChI: InChI=1S/C18H20ClNO2/c1-11-4-3-5-12(8-11)15-10-20(2)7-6-13-14(15)9-16(21)18(22)17(13)19/h3-5,8-9,15,21-22H,6-7,10H2,1-2H3
charge 0 multiplicity 1
42 atoms
Cl 4.723908 -0.168767 -0.85029
O  1.354387 -3.503325 1.243265
O  3.859076 -2.795025 0.437898
N  0.438594 3.233663 -0.010242
C  -0.54674 0.893584 -0.21325
C  -0.369785 2.185241 0.6555
C  0.638693 -0.078269 -0.053336
C  1.875604 2.906135 -0.162145
C  2.144272 1.714176 -1.116748
C  1.933591 0.343864 -0.496316
C  -1.90542 0.236994 0.036548
C  0.464062 -1.359425 0.520693
C  0.24799 4.553063 0.629684
C  2.995041 -0.571472 -0.324931
C  -2.668644 -0.237436 -1.058379
C  -2.435463 0.08657 1.344759
C  1.547891 -2.240965 0.674082
C  2.839075 -1.847706 0.247146
C  -3.935656 -0.850344 -0.884449
C  -3.698459 -0.513846 1.538006
C  -4.445756 -0.978717 0.432458
C  -4.716124 -1.373608 -2.078556
H  -0.544908 1.259275 -1.260803
H  -1.372122 2.618834 0.824871
H  0.047075 1.908768 1.657899
H  2.367367 2.703897 0.824099
H  2.363791 3.801911 -0.591089
H  3.184668 1.794787 -1.473809
H  1.488904 1.844366 -2.000248
H  -0.522098 -1.696406 0.847237
H  0.781069 5.327105 0.04858
H  0.619436 4.59932 1.684519
H  -0.826353 4.80987 0.636195
H  -2.26597 -0.124735 -2.073942
H  -1.864479 0.438157 2.211994
H  -4.10107 -0.620136 2.551889
H  -5.42749 -1.44192 0.590219
H  -4.532005 -0.765404 -2.981862
H  -4.422925 -2.414228 -2.318822
H  -5.80287 -1.375693 -1.882892
H  2.223484 -3.983955 1.265505
H  4.726057 -2.442795 0.107665
