program: Gaussian 09
title: 000133529
version: EM64L-G09RevD.01
frameworkgroup: C1[X(C19H29FO2)]
method: RPBEPBE
basis: SDD
operation: Freq
keyword: #p
keyword: freq=noraman
keyword: PBEPBE/SDD
title: #p freq=noraman PBEPBE/SDD
converged: YES YES NO NO
title: Mulliken charges:
elementType: F O O C C C C C C C C C C C C C C C C C C C H H H H H H H H H H H H H H H H H H H H H H H H H H H H H
charge: -0.221820 -0.433309 -0.152819 -0.121159 0.417006 -0.102566 -0.164588 -0.016566 0.300352 -0.544311 -0.503438 -0.521157 -0.497246 -0.524571 -0.596672 -0.532223 -0.865967 0.044419 -0.069665 -0.468259 -0.083496 -0.792481 0.198295 0.232681 0.242393 0.191754 0.218358 0.227193 0.211472 0.205807 0.220669 0.224621 0.200498 0.208780 0.211289 0.213265 0.263549 0.219423 0.214496 0.191771 0.222699 0.222415 0.223222 0.226070 0.194375 0.219992 0.218996 0.244414 0.240556 0.222315 0.319165
chargesum: 0.00000
title: Mulliken charges with hydrogens summed into heavy atoms:
elementType: F O O C C C C C C C C C C C C C C C C C C C
charge: -0.221820 -0.114145 -0.152819 0.077136 0.417006 0.130115 0.077806 0.175188 0.300352 -0.098760 -0.086158 -0.075867 -0.087968 -0.100017 -0.113700 -0.125955 -0.197630 0.044419 0.156405 -0.053892 0.135501 -0.085196
polarizability: 2.41761603e+02 1.87712423e+00 1.86850368e+02 1.53817909e+00 2.22218733e+00 1.61757301e+02
1716.lowfreq: -7.5755 -0.0010 -0.0009 -0.0005 6.3047 14.4064 35.2934 42.7204 71.5374
frequency: 34.6687 42.5968 71.5305 89.3617 111.0137 139.0057 154.6952 168.5456 202.0304 205.9653 221.8636 228.8331 247.8448 253.8840 260.7425 277.2892 286.5513 288.4680 302.2492 317.4328 341.9806 363.3068 370.9140 392.7504 398.7936 421.9491 437.3765 448.2749 464.7630 478.9216 511.1834 521.6274 547.6316 561.1171 561.6994 617.4250 657.5747 692.7145 720.8506 761.6380 791.5458 800.6680 818.1989 828.0245 838.0554 857.6876 885.7157 894.2820 914.3915 922.2373 931.4998 947.5033 961.2552 964.5772 989.9949 991.1595 999.4837 1008.3139 1009.1520 1015.9139 1023.0871 1047.5908 1059.8963 1068.8315 1085.6177 1093.5847 1110.4987 1113.7772 1124.5480 1128.8590 1142.7162 1145.9658 1153.9330 1161.7435 1182.2726 1187.3228 1192.2127 1210.3019 1224.9264 1230.3639 1240.9749 1247.3709 1256.5922 1261.8079 1270.8889 1275.6805 1284.0699 1299.1493 1299.7285 1309.5171 1317.6604 1321.6085 1325.0181 1330.1863 1333.1350 1340.1694 1340.6147 1345.8741 1351.6617 1354.3898 1361.6608 1371.4912 1375.0995 1385.4656 1396.0594 1454.1882 1456.4110 1461.9841 1464.4500 1465.2766 1467.7899 1474.2598 1478.6125 1484.2091 1489.7293 1491.8590 1498.2903 1667.0552 2904.5019 2916.5860 2930.1977 2950.6929 2955.2204 2956.9327 2966.0369 2968.1247 2970.5056 2981.8401 2983.8112 2990.5038 2995.8564 3009.3584 3015.5315 3017.7879 3026.9768 3029.6095 3033.4339 3039.8349 3047.5068 3049.2500 3065.8240 3077.1462 3079.4317 3083.2457 3086.5240 3099.2924 3544.4693
redmass: 6.1606 6.9356 3.2955 4.7698 5.4109 2.4772 2.6816 1.4124 2.8932 2.4574 1.9662 4.9318 2.5045 1.9559 2.1328 1.9086 2.7663 1.7486 2.6412 2.7268 2.4730 3.4041 2.5099 3.2835 2.8157 2.7737 3.1142 1.9059 3.4028 2.7717 2.4376 2.4635 2.5475 3.8222 3.4095 3.0076 3.7291 3.0157 2.7413 4.5494 1.8975 2.1289 2.7891 2.5329 2.2973 2.0174 2.3193 1.7321 2.1183 1.8438 1.8922 1.7868 2.1993 2.1200 1.9339 2.1079 2.3195 2.2358 1.9748 1.9846 1.8544 2.3038 1.8861 3.0016 2.3911 1.8307 1.5786 2.7057 1.9766 1.4705 1.8986 1.6783 1.6062 2.2296 1.6402 2.0234 1.9126 1.9507 1.5292 2.0786 1.7319 1.2978 1.6856 1.5231 1.2471 1.3670 1.4527 1.3820 1.4177 1.4292 1.3443 1.3936 1.4384 1.3049 1.3475 1.4254 1.4179 1.4609 1.4580 1.4343 1.4418 1.2293 1.4401 1.1850 1.2292 1.0823 1.0846 1.0791 1.0848 1.0765 1.0883 1.0814 1.0932 1.0660 1.0575 1.0609 1.0581 12.0242 1.0810 1.0805 1.0800 1.0646 1.0648 1.0643 1.0654 1.0769 1.0641 1.0597 1.0613 1.0381 1.0384 1.0647 1.0883 1.0930 1.1001 1.0974 1.0965 1.0962 1.0979 1.1023 1.0880 1.0989 1.0972 1.0993 1.0967 1.0980 1.0657
irintensity: 0.5970 2.8088 0.1231 3.0215 1.5480 1.3788 1.7923 0.7095 3.5310 2.0756 0.4379 1.3897 1.5421 10.3408 0.4732 19.3087 0.8988 28.5622 18.0430 15.3963 31.9028 1.8522 2.8877 0.1407 0.1466 0.8603 2.4614 5.2923 2.1264 1.5363 0.8499 0.9331 0.1803 4.0347 1.9861 6.8419 1.5559 3.5096 1.0945 6.7857 0.7708 1.6879 7.8020 2.1972 36.0119 5.2299 8.3496 9.5258 7.2747 16.1736 3.5483 10.4509 43.1739 12.8266 6.8857 17.4729 23.5445 83.8843 1.5052 26.1533 3.5070 1.3627 3.7252 1.9674 5.3889 2.4712 18.9317 0.4418 9.4467 1.6735 4.0984 14.7755 2.1798 2.6344 6.3550 7.8499 0.3900 24.6375 1.8921 3.8692 5.9708 0.3200 7.5721 11.6556 1.8699 0.0798 4.8006 6.6857 1.1246 0.9387 1.7217 1.1467 0.3269 1.2526 0.0447 1.3350 2.6301 0.6522 1.1511 3.7090 1.5881 30.1179 12.6069 19.6768 26.6017 7.6678 2.1235 3.2556 7.8580 9.4502 24.8513 5.7892 10.9688 7.2927 7.2986 5.1779 10.2506 160.4830 5.6632 20.2685 7.5230 22.6800 28.2258 11.9419 19.4909 58.6857 43.2010 24.6525 16.3801 16.6479 31.6413 8.5716 11.5440 49.1289 25.4050 39.6507 63.6974 43.6652 69.2255 54.4882 34.0239 23.9857 37.3320 11.7727 46.1143 23.2521 7.2555
temp: 298.150 k
press: 1.00000 atm
elementType: 9 8 8 6 6 6 6 6 6 6 6 6 6 6 6 6 6 6 6 6 6 6 1 1 1 1 1 1 1 1 1 1 1 1 1 1 1 1 1 1 1 1 1 1 1 1 1 1 1 1 1
symmnumber: 1
zpe: 1168517.1 jmol-1
zpe.correction: 0.445065 hartree
zpe.thermalcorrener: 0.465914 hartree
zpe.thermalcorrenthalpy: 0.466859 hartree
zpe.thermalcorrgfe: 0.397509 hartree
zpe.sumelectzpe: -989.985744 hartree
zpe.sumelectthermal: -989.964895 hartree
zpe.sumelectthermalent: -989.963950 hartree
zpe.sumelectthermalfe: -990.033300 hartree
dipole: 1.7882 0.3987 4.1832
dipole: 4.5668
quadrupole: -174.0822 -134.2915 -133.8866
quadrupole: -9.8678 -5.1351 1.4276
quadrupole: -26.6621 13.1286 13.5335 -9.8678 -5.1351 1.4276
hfenergy: -990.4308091 hartree
pointgroup: C01 [X(C19H29F1O2)]
dipole: 0.7019203 0.1886621 1.643135 debye
polarizability: 241.7653536|1.7941209|186.9224219|1.6011476|1.7121804|161.6814962 unknown
InChI: InChI=1S/C19H29FO2/c1-18-7-5-12(21)9-11(18)3-4-13-14(18)6-8-19(2)15(13)10-16(20)17(19)22/h11-16,21H,3-10H2,1-2H3
charge 0 multiplicity 1
51 atoms
F  -4.487085 1.44091 -1.552828
O  6.19756 0.199747 -0.565353
O  -4.865324 -1.387942 -0.58001
C  0.367668 -0.458317 -0.20874
C  1.886363 -0.42969 0.217657
C  -0.468223 0.676911 0.482394
C  -1.912058 0.587321 -0.046839
C  2.440321 1.005673 -0.119811
C  -2.579841 -0.791215 0.248554
C  -0.299083 -1.859415 -0.057172
C  0.153781 2.069722 0.216902
C  -1.792858 -1.896234 -0.484941
C  1.649849 2.124107 0.5951
C  2.695482 -1.452553 -0.643477
C  -2.986061 1.625388 0.376843
C  3.968799 1.127472 0.096492
C  2.05429 -0.779188 1.722533
C  -4.022008 -0.539731 -0.218397
C  -4.286776 1.001711 -0.157736
C  4.230368 -1.339444 -0.467186
C  4.735375 0.089455 -0.746699
C  -2.709902 -1.120477 1.772804
H  0.35464 -0.217839 -1.299016
H  -0.473978 0.508585 1.579913
H  -1.841321 0.663319 -1.156196
H  2.265249 1.143082 -1.213055
H  -0.211153 -2.207613 0.990009
H  0.2505 -2.595888 -0.672002
H  -0.408586 2.844484 0.774353
H  0.04401 2.31115 -0.862126
H  -1.871122 -1.730802 -1.577982
H  -2.224813 -2.893761 -0.27973
H  2.072459 3.10972 0.315887
H  1.768622 2.033049 1.69372
H  2.443193 -1.290764 -1.71349
H  2.387678 -2.486791 -0.398774
H  -2.829694 2.624999 -0.061635
H  -3.036739 1.741482 1.476235
H  4.307013 2.143136 -0.185894
H  4.224577 0.995877 1.169563
H  1.77795 -1.832199 1.91223
H  3.098924 -0.653904 2.055219
H  1.429075 -0.145948 2.375461
H  -5.215332 1.261832 0.378138
H  4.514746 -1.627922 0.566689
H  4.744592 -2.045752 -1.145666
H  4.602193 0.32291 -1.819742
H  -3.273405 -2.062928 1.893628
H  -1.72025 -1.249881 2.240036
H  -3.244148 -0.333761 2.335458
H  6.408885 -0.013184 0.379977
