program: Gaussian 09
title: 000133503
version: EM64L-G09RevD.01
frameworkgroup: C1[X(C7H9NO5)]
method: RPBEPBE
basis: SDD
operation: Freq
keyword: #pfreq=noraman
keyword: PBEPBE/SDD
title: #p freq=noraman PBEPBE/SDD
converged: YES YES NO NO
title: Mulliken charges:
elementType: O O O O O N C C C C C C C H H H H H H H H H
charge: -0.410311 -0.241182 -0.245888 -0.397178 -0.269246 -0.407465 0.182422 -0.536506 -0.467089 0.170632 0.219428 -0.595122 0.228899 0.258099 0.268652 0.278434 0.266712 0.357123 0.285138 0.286194 0.383886 0.384366
chargesum: 0.00000
title: Mulliken charges with hydrogens summed into heavy atoms:
elementType: O O O O O N C C C C C C C
charge: -0.026425 -0.241182 -0.245888 -0.012812 -0.269246 -0.050342 0.182422 -0.009755 0.078057 0.170632 0.219428 -0.023789 0.228899
polarizability: 1.18514245e+02 2.76887335e+00 8.94536205e+01 6.50442999e-01 -4.37902475e+00 8.06881326e+01
1716.lowfreq: -0.0007 0.0005 0.0008 2.0206 3.7028 10.6495 27.8476 39.8395 64.0315
frequency: 27.8340 39.7895 64.0260 76.1276 79.4346 115.3493 175.4511 250.4899 257.6286 306.5925 350.5368 373.0250 390.9202 458.7355 484.7939 530.1335 588.2196 593.9336 606.0338 646.2078 668.0787 706.9931 745.4137 755.0650 785.1687 837.0710 888.8505 907.2136 931.2334 946.9577 996.0167 1007.8961 1041.3749 1065.5216 1080.5123 1092.0510 1175.6065 1182.2850 1215.8098 1232.6444 1259.3696 1315.5737 1352.4966 1363.2142 1420.3778 1426.4289 1448.0376 1521.2234 1624.1084 1649.2438 1650.3229 2997.9934 3107.4926 3108.7364 3125.9618 3217.3090 3241.2341 3410.3520 3502.4013 3522.2206
redmass: 5.1334 7.9765 10.6488 4.6292 5.8034 5.1079 5.8396 3.2461 2.8727 8.0569 4.3757 5.7780 4.1862 3.8586 3.4130 3.7334 1.9641 2.2837 2.1556 3.5747 1.7679 3.4762 1.8640 1.5737 1.2213 3.8313 4.6671 4.0536 2.4306 2.0870 1.9660 2.2538 2.8073 2.1044 1.2597 1.3681 1.3164 1.1720 2.2388 2.0366 1.8214 3.2626 2.1350 3.5612 1.1085 1.0911 1.3042 1.8037 8.3723 7.4023 6.8919 1.0679 1.0543 1.0913 1.0585 1.1180 1.1169 1.0803 1.0640 1.0641
irintensity: 0.2736 0.8489 1.4285 2.4578 9.2402 3.3390 6.9391 1.9518 1.5853 1.3466 1.3392 5.3482 5.1419 31.4622 8.7211 60.3487 60.7830 72.0379 92.6921 37.7302 73.7967 43.0831 31.7079 57.6391 9.8067 3.3339 3.6798 6.1219 3.6957 9.5136 0.2077 8.0158 237.0582 317.4706 89.4835 5.6960 0.3683 2.1472 5.3079 47.2329 26.5541 33.1112 137.7288 88.3668 41.3943 16.5327 19.0594 310.9213 54.8462 285.7498 237.7075 0.7328 6.4318 0.5905 2.0548 1.4490 3.5022 173.7516 29.6755 34.9876
temp: 298.150 k
press: 1.00000 atm
elementType: 8 8 8 8 8 7 6 6 6 6 6 6 6 1 1 1 1 1 1 1 1 1
symmnumber: 1
zpe: 424322.2 jmol-1
zpe.correction: 0.161616 hartree
zpe.thermalcorrener: 0.174665 hartree
zpe.thermalcorrenthalpy: 0.175609 hartree
zpe.thermalcorrgfe: 0.120120 hartree
zpe.sumelectzpe: -702.027598 hartree
zpe.sumelectthermal: -702.014549 hartree
zpe.sumelectthermalent: -702.013605 hartree
zpe.sumelectthermalfe: -702.069094 hartree
dipole: -3.2326 1.3494 -2.1681
dipole: 4.1197
quadrupole: -71.6693 -69.5513 -79.4399
quadrupole: -1.6736 0.3450 7.3007
quadrupole: 1.8842 4.0022 -5.8864 -1.6736 0.3450 7.3007
hfenergy: -702.1892141 hartree
pointgroup: C01 [X(C7H9N1O5)]
dipole: 1.1719143 0.6543526 0.9085281 debye
dipolederiv: -0.360105 0.2203681 -0.1726522 0.2541073 -0.7860607 0.4189399 -0.1875704 0.4095026 -0.7552337 -1.1177062 0.01255 -0.0582539 -0.1565984 -0.4789157 0.1417197 0.0178729 0.1360284 -0.4436913 -0.6199851 -0.1117276 -0.2115707 0.1255303 -0.6500119 -0.2724945 -0.0063058 -0.3649117 -0.7147726 -1.4483398 0.0269139 0.0303052 -0.1049643 -0.2902392 0.0765392 0.0827431 0.1068434 -0.3271595 -0.8996562 0.020978 -0.0204752 0.1747217 -0.6533936 -0.3044696 0.1569158 -0.2578788 -0.5549752 -0.9351595 0.2663161 0.1178912 0.3209459 -0.772585 -0.1418275 0.0949672 -0.0849357 -0.4758855 0.5595533 -0.2348247 0.0298686 -0.2299798 -0.2357641 0.3106451 0.175716 0.253339 -0.0864794 -0.0238934 -0.0338678 0.0260348 0.1141166 -0.0421687 -0.0210885 -0.0340407 -0.26492 0.0975514 -0.040023 -0.0456907 0.062042 0.0488392 0.2141091 -0.1185163 -0.0722235 0.0622925 -0.0912231 1.2582037 0.1598092 0.0303522 0.129628 1.022137 -0.7343057 0.0367217 -0.6723029 0.7948866 1.2276262 -0.1802968 0.2473656 -0.5872109 0.883766 0.4854952 -0.0202499 0.6076896 0.8317054 -0.4403273 -0.0561098 -0.1928767 -0.0715133 -0.217223 -0.1432258 -0.2518798 -0.1056699 -0.0739335 1.7808334 0.0559007 -0.0615648 0.1397979 0.8241767 0.4960073 -0.2116767 0.3905814 0.5318685 0.0206854 -0.07555 -0.0313664 -0.0835177 -0.0110268 -0.0168578 0.0170066 -0.0226688 0.0943814 -0.024306 0.0563133 0.060731 0.0119378 0.0598107 -0.0195438 0.0401076 -0.0236221 0.0910861 0.0047246 -0.029315 -0.0504743 -0.0364513 0.0820367 -0.0412841 -0.0275494 -0.0131695 0.0548867 0.0185437 -0.008096 0.0662441 -0.0526362 0.0875624 -0.0004247 0.079007 0.006748 0.0158185 0.4153235 0.0751547 0.052917 0.1339344 0.2394201 -0.0021223 0.107845 -0.0407111 0.2651777 0.1252803 -0.0237648 0.0050739 -0.0237632 0.0664069 0.0337453 -0.0345822 0.0520393 0.0439098 0.0194899 0.0009968 0.0221348 0.0000512 0.1333625 -0.0290533 0.0498999 -0.0515017 0.0417333 0.1141823 -0.0940169 0.0424286 -0.0574081 0.3214817 0.0315972 -0.0055673 0.0192124 0.3684032 0.365055 -0.0020406 0.0058451 -0.0495671 0.2031187 -0.1494751 -0.007157 -0.1419845 0.2919452 unknown
polarizability: 117.761902|-2.8776597|90.519816|5.5151869|2.6036959|80.3742804 unknown
InChI: InChI=1S/C7H9NO5/c9-4(3-5(10)11)8-7(1-2-7)6(12)13/h8,10,12H,1-3H2
charge 0 multiplicity 1
22 atoms
O  -1.942732 -1.264959 1.497341
O  -3.764328 -0.294561 0.428449
O  0.180564 -1.297803 -1.254293
O  4.093763 0.292678 0.793503
O  2.162235 1.196864 1.689054
N  -0.136523 0.388467 0.333963
C  -1.526359 0.60437 0.027824
C  -2.009765 2.06844 -0.157855
C  -1.904865 1.158483 -1.366916
C  -2.528735 -0.331454 0.636096
C  0.608209 -0.582791 -0.303837
C  2.03782 -0.81549 0.239071
C  2.714122 0.320347 0.974862
H  -1.24895 2.841873 -0.018524
H  -3.005748 2.300145 0.227413
H  -2.827915 0.768075 -1.800148
H  -1.068619 1.288345 -2.056632
H  0.299753 0.891098 1.119446
H  1.97033 -1.674677 0.937673
H  2.668447 -1.14818 -0.599262
H  -2.656938 -1.866796 1.841512
H  4.515533 1.032126 1.311961
