program: Gaussian 09
title: 000133479
version: EM64L-G09RevD.01
frameworkgroup: C1[X(C14H19NO3)]
method: RPBEPBE
basis: SDD
operation: Freq
keyword: #p
keyword: freq=noraman
keyword: PBEPBE/SDD
title: #p freq=noraman PBEPBE/SDD
converged: NO YES NO NO
title: Mulliken charges:
elementType: O O O N C C C C C C C C C C C C C C H H H H H H H H H H H H H H H H H H H
charge: -0.438005 -0.440924 -0.490916 -0.357070 -0.077162 -0.156469 -0.472109 -0.501713 -0.436215 -0.339217 -0.438487 -0.518378 0.425245 0.138337 -0.415665 0.005304 0.138642 -0.373754 0.213279 0.219002 0.225359 0.219247 0.221585 0.223136 0.223016 0.212930 0.270601 0.233633 0.235999 0.209365 0.254032 0.233125 0.243026 0.330737 0.221253 0.385923 0.373310
chargesum: 0.00000
title: Mulliken charges with hydrogens summed into heavy atoms:
elementType: O O O N C C C C C C C C C C C C C C
charge: -0.107269 -0.055002 -0.117607 -0.086469 0.136117 0.062533 -0.027503 -0.056992 -0.000269 -0.105583 0.006877 -0.031222 0.425245 0.138337 -0.172639 0.005304 0.138642 -0.152501
polarizability: 2.06664075e+02 1.37293600e+01 1.55030574e+02 1.74875198e+01 -1.29140775e+01 1.35111708e+02
1716.lowfreq: -36.0861 -13.0436 -7.4088 -0.0008 -0.0004 0.0005 9.5501 27.2559 45.6241
frequency: -31.4405 27.2436 45.5586 80.8785 103.4568 128.2500 151.7904 172.5935 211.0726 222.5989 255.6856 257.9072 284.3173 287.5328 292.5325 316.7589 342.8802 385.0033 421.4419 453.4726 470.0708 492.3013 494.3215 510.3867 550.2790 576.9884 588.1133 618.5471 626.2406 672.2438 694.0035 717.7609 762.7521 770.9514 787.5784 791.1948 840.7005 877.0975 879.5971 906.6622 911.9369 927.8662 942.3006 946.5623 960.8795 979.3440 988.1031 1024.3222 1052.1974 1097.7843 1115.9952 1124.0750 1128.0665 1150.3704 1162.7457 1170.3381 1174.5150 1188.5667 1203.1387 1210.9668 1213.4105 1216.6886 1232.4109 1236.0573 1238.8232 1252.0144 1256.6431 1270.8349 1289.5395 1302.2413 1324.9978 1345.1220 1349.1066 1353.2363 1386.7775 1413.6435 1440.3949 1445.5385 1451.0302 1458.1517 1463.2134 1475.1294 1484.2500 1489.1899 1599.1715 1633.6388 2874.1048 2963.9050 2970.7754 2979.8099 2998.9745 3010.0256 3011.4707 3023.4433 3034.7436 3053.4336 3078.3476 3085.7295 3104.5484 3122.8807 3151.6741 3418.6014 3521.5314 3532.0012 3625.4280
redmass: 2.7281 4.8380 3.8356 4.6915 3.0536 4.7117 2.8904 3.1548 3.9758 4.3450 2.5460 1.3160 3.0059 4.1380 1.2723 3.2696 2.7404 4.4033 3.3530 2.7986 4.6219 1.4386 2.2634 3.4343 3.0444 4.2658 1.8425 2.6889 3.5636 4.7344 2.3092 4.0500 2.3046 1.8458 1.2813 1.6407 3.7201 2.2512 2.2383 2.1184 2.0180 2.0327 3.1639 2.1933 1.7476 2.6305 3.2220 2.2174 2.0577 1.8261 2.4140 1.7957 1.3632 1.4634 1.4701 1.5124 1.7267 1.5083 1.5486 1.3231 1.2049 1.8428 1.5248 1.4733 1.3955 1.5852 1.3600 2.3830 1.3643 1.3351 1.6694 1.4772 1.5445 1.4257 1.9565 3.7800 1.2505 1.0884 1.2028 1.0889 1.0928 1.1290 3.3866 2.9409 7.7467 7.2017 1.0828 1.0687 1.0830 1.0815 1.0655 1.0573 1.0565 1.0645 1.0905 1.1028 1.1071 1.1079 1.1073 1.0882 1.0960 1.0736 1.0647 1.0659 1.0666
irintensity: 0.2080 0.2177 0.9199 0.2415 0.1919 4.1204 0.5991 0.0888 13.3299 9.0774 31.9606 130.9299 16.7983 2.1251 84.7135 33.9791 4.2161 0.5771 7.3453 7.6659 9.5556 112.0563 24.9154 0.8329 12.9573 15.5565 45.9332 8.4970 17.1136 15.9387 11.9561 2.8383 1.3052 9.9005 5.9802 60.3413 25.3140 17.0101 2.3679 45.2657 29.4307 10.3163 17.1440 14.3722 11.3482 4.0143 30.4952 49.1759 55.1839 6.6357 3.4026 11.1453 55.4214 43.2910 6.2967 16.5754 7.6915 43.9852 52.8619 8.9126 1.2367 15.5563 17.1099 16.5245 8.6360 155.5266 42.4841 116.7879 6.9452 6.6564 6.0795 47.3701 19.4545 9.0213 21.6623 11.0833 25.3810 5.1625 2.9568 5.9756 14.1693 5.0434 15.5913 55.3303 6.8649 32.3653 66.2184 17.6794 21.7726 45.8160 46.7497 76.3962 17.5161 42.2130 15.9296 37.6703 17.0400 16.9005 77.2172 13.2445 12.9636 0.6044 79.3479 8.7103 57.8960
temp: 298.150 k
press: 1.00000 atm
elementType: 8 8 8 7 6 6 6 6 6 6 6 6 6 6 6 6 6 6 1 1 1 1 1 1 1 1 1 1 1 1 1 1 1 1 1 1 1
symmnumber: 1
zpe: 805753.8 jmol-1
zpe.correction: 0.306895 hartree
zpe.thermalcorrener: 0.323364 hartree
zpe.thermalcorrenthalpy: 0.324308 hartree
zpe.thermalcorrgfe: 0.263067 hartree
zpe.sumelectzpe: -823.903594 hartree
zpe.sumelectthermal: -823.887125 hartree
zpe.sumelectthermalent: -823.886181 hartree
zpe.sumelectthermalfe: -823.947422 hartree
dipole: -0.6115 -0.0291 -1.7667
dipole: 1.8698
quadrupole: -88.2131 -106.4872 -106.3176
quadrupole: 4.4618 12.5298 -2.2435
quadrupole: 12.1262 -6.1479 -5.9783 4.4618 12.5298 -2.2435
hfenergy: -824.2104891 hartree
pointgroup: C01 [X(C14H19N1O3)]
dipole: -0.235869 0.109075 -0.6882079 debye
polarizability: 206.0975076|10.9928259|159.1254444|20.3680557|-8.3418974|131.5834052 unknown
InChI: InChI=1S/C14H19NO3/c16-12-7-5-9-10(14(12)18)4-6-11(13(9)17)15-8-2-1-3-8/h5,7-8,11,13,15-18H,1-4,6H2
charge 0 multiplicity 1
37 atoms
O  -0.123541 2.77326 1.224246
O  -2.705916 -2.258178 0.692038
O  -4.588514 -1.185043 -0.897137
N  1.956366 0.108634 -0.437681
C  3.187134 -0.649439 -0.179069
C  1.379514 0.841432 0.71771
C  4.496415 0.181474 0.065737
C  3.873458 -1.294912 -1.428749
C  5.259964 -0.836372 -0.853119
C  0.2333 1.747866 0.204325
C  0.839441 -0.034776 1.88066
C  -0.26112 -0.994949 1.387269
C  -1.039688 0.973564 -0.097626
C  -1.263476 -0.314783 0.467109
C  -2.011313 1.556394 -0.94563
C  -2.467513 -0.984374 0.152046
C  -3.435315 -0.386913 -0.690002
C  -3.21706 0.887222 -1.245441
H  3.079527 -1.415638 0.62667
H  2.182478 1.499727 1.108254
H  4.849849 0.299564 1.103556
H  4.407576 1.172407 -0.413929
H  3.606587 -0.729848 -2.339624
H  3.717979 -2.372768 -1.601796
H  5.988107 -0.420518 -1.567689
H  5.7497 -1.635683 -0.269757
H  1.248328 -0.458987 -0.926935
H  0.589876 2.253545 -0.717604
H  0.427835 0.649066 2.647577
H  1.658207 -0.610045 2.351851
H  -0.799603 -1.441583 2.243162
H  0.188037 -1.858047 0.852905
H  -1.825199 2.551805 -1.362306
H  0.640687 3.402128 1.302101
H  -3.96627 1.349588 -1.899687
H  -3.601382 -2.565114 0.389543
H  -5.257254 -0.724409 -1.457279
