program: Gaussian 09
title: 000133478
version: EM64L-G09RevD.01
frameworkgroup: C1[X(C20H16N2)]
method: RPBEPBE
basis: SDD
operation: Freq
keyword: #pfreq=noraman
keyword: PBEPBE/SDD
title: #p freq=noraman PBEPBE/SDD
converged: YES YES NO NO
title: Mulliken charges:
elementType: N N C C C C C C C C C C C C C C C C C C C C H H H H H H H H H H H H H H H H
charge: -0.427442 -0.034062 0.256491 0.290521 0.297808 -0.014162 -0.655512 0.032159 0.470147 -0.384524 -0.408077 -0.393704 -0.368510 -0.275892 -0.232528 -0.269509 -0.232590 -0.368885 -0.449677 -0.224737 -0.221927 -0.246463 0.267389 0.232624 0.307522 0.242067 0.225984 0.237419 0.258916 0.229219 0.230068 0.226621 0.229649 0.246198 0.237611 0.230016 0.228502 0.231271
chargesum: 0.00000
title: Mulliken charges with hydrogens summed into heavy atoms:
elementType: N N C C C C C C C C C C C C C C C C C C C C
charge: -0.119920 -0.034062 0.256491 0.290521 0.297808 -0.014162 -0.155499 0.032159 0.470147 -0.142457 -0.182093 -0.156285 -0.109594 -0.046674 -0.002461 -0.042888 -0.002941 -0.122687 -0.212066 0.005279 0.006574 -0.015191
polarizability: 3.14023142e+02 -3.74434951e+01 2.50278092e+02 2.41433340e+01 9.89983172e+00 1.32717160e+02
1716.lowfreq: -0.0006 -0.0004 0.0006 3.7636 6.4866 9.9974 20.3068 25.9112 32.2377
frequency: 20.0412 25.8175 32.1269 76.7584 95.5103 111.2410 139.6294 174.3226 224.3180 251.5162 266.8312 314.1878 317.3608 346.8667 370.6685 404.1860 430.4607 448.1636 483.1530 494.8127 505.9814 523.4973 562.6745 572.9195 589.7019 614.3422 615.3622 633.6183 657.2684 679.9774 705.4184 717.7562 724.1692 752.3776 761.3140 767.7543 771.4449 793.5482 829.4533 847.9401 858.5018 860.8081 880.2401 910.4849 938.6887 943.9814 952.7748 957.5502 973.8445 981.7523 984.4008 990.6062 991.4793 998.9712 1026.9855 1053.0629 1058.6738 1081.5545 1090.9287 1128.1627 1156.2352 1169.8504 1173.1022 1176.8238 1189.5169 1191.4307 1209.9564 1220.4981 1251.8738 1267.4469 1273.2079 1284.4505 1300.6160 1333.7983 1357.6079 1373.3860 1380.8965 1421.0462 1427.0089 1439.2493 1452.1012 1467.2311 1479.3346 1484.0391 1515.0307 1570.0477 1590.9000 1592.7927 1596.9936 1611.4574 1613.6553 1661.7865 2982.3966 3068.1521 3114.5177 3115.4190 3122.0055 3127.1002 3134.5549 3134.8693 3139.4108 3146.1779 3148.3604 3155.7251 3164.1009 3167.8541 3170.1775 3485.1134
redmass: 4.3082 4.0765 5.2968 4.0575 4.8206 4.9778 4.2232 5.0219 4.7256 4.6490 5.1466 3.2328 3.0212 4.7935 5.4272 2.8184 3.8613 4.1417 4.1138 3.2165 4.8628 3.8485 3.6442 4.3064 4.0125 6.6448 6.2014 4.2200 2.1560 3.7729 2.5268 2.0404 2.9618 2.1531 1.7169 1.8607 1.6374 4.8341 4.1749 3.7476 1.4028 1.2984 1.4579 1.5900 1.3895 2.5487 1.6713 2.2569 1.3275 1.3954 1.3305 6.0858 7.3156 1.3191 2.2186 1.9796 2.1600 1.6084 2.4084 1.5502 1.4560 1.0740 1.0615 1.0734 1.2115 2.1729 2.0106 2.5976 2.0297 2.4419 1.5744 1.8294 1.6940 1.3000 7.6625 7.1916 7.8251 1.9628 2.3812 1.8896 1.2041 2.5828 2.3497 2.2702 2.2487 6.5472 5.7709 5.6230 6.0459 5.4884 6.0445 6.1821 1.0667 1.0935 1.0877 1.0882 1.0868 1.0850 1.0910 1.0871 1.0897 1.0958 1.0930 1.0945 1.1014 1.1005 1.0997 1.0750
irintensity: 0.0766 0.1928 0.1318 0.3459 0.9565 4.2574 1.8852 0.2946 2.6972 2.1241 0.4913 0.4493 1.9611 0.7821 2.1249 0.3121 2.6587 7.4464 7.2921 5.7074 1.4888 10.0493 3.1210 2.1268 9.0329 4.4457 1.2933 6.7626 25.1008 14.9859 16.3550 90.4905 27.6792 33.2459 99.8186 0.7705 64.2643 1.3143 9.8642 13.1799 1.4753 2.6195 0.7678 2.5383 4.1254 6.8533 3.7875 7.3592 0.1256 0.0205 0.5654 0.5243 3.1021 0.3923 8.6127 4.6110 4.7633 12.8386 9.2782 7.1558 35.9638 0.4211 0.5340 0.7536 0.7884 8.1886 1.6163 1.2023 8.5309 62.4106 8.5337 6.3189 5.3744 0.4173 0.5121 57.8245 0.2653 17.2137 41.4712 3.4585 35.6128 100.4544 130.8177 22.2164 3.6877 2.6181 44.3780 27.9696 23.9382 5.6325 11.4070 260.0967 13.9169 2.0905 7.8029 11.7261 3.3361 0.8276 9.5858 5.8388 15.5254 36.2938 12.6592 27.4023 24.0052 31.0644 22.1126 24.3512
temp: 298.150 k
press: 1.00000 atm
elementType: 7 7 6 6 6 6 6 6 6 6 6 6 6 6 6 6 6 6 6 6 6 6 1 1 1 1 1 1 1 1 1 1 1 1 1 1 1 1
symmnumber: 1
zpe: 795081.5 jmol-1
zpe.correction: 0.302831 hartree
zpe.thermalcorrener: 0.319782 hartree
zpe.thermalcorrenthalpy: 0.320726 hartree
zpe.thermalcorrgfe: 0.256244 hartree
zpe.sumelectzpe: -879.741568 hartree
zpe.sumelectthermal: -879.724617 hartree
zpe.sumelectthermalent: -879.723672 hartree
zpe.sumelectthermalfe: -879.788155 hartree
dipole: -2.0288 1.6377 -0.9575
dipole: 2.7776
quadrupole: -110.6100 -120.8603 -128.8138
quadrupole: -1.2964 4.9418 4.6326
quadrupole: 9.4847 -0.7656 -8.7191 -1.2964 4.9418 4.6326
hfenergy: -880.0443986 hartree
pointgroup: C01 [X(C20H16N2)]
dipole: 0.7154415 -0.8129266 -0.1464774 debye
polarizability: 303.5128649|-52.2260486|239.3916213|-17.8424452|-43.3475284|154.1139068 unknown
InChI: InChI=1S/C20H16N2/c1-2-8-15(9-3-1)14-20-21-18-12-6-4-10-16(18)17-11-5-7-13-19(17)22-20/h1-13,21H,14H2
charge 0 multiplicity 1
38 atoms
N  0.284614 -0.336298 -0.915786
N  -0.558433 1.874139 -0.309126
C  -1.747407 -0.945041 0.427829
C  -2.533491 0.278627 0.064464
C  -0.456238 -1.248672 -0.098743
C  0.385076 1.053275 -0.687709
C  1.759028 1.648467 -1.016642
C  -1.945732 1.556644 -0.217519
C  2.951788 0.850009 -0.499877
C  -2.327387 -1.904203 1.3038
C  0.163228 -2.491892 0.187446
C  -3.952659 0.18236 0.032906
C  -2.791411 2.676469 -0.444475
C  -1.712513 -3.139922 1.596111
C  -0.464315 -3.446497 1.012822
C  -4.781102 1.293758 -0.22744
C  -4.194525 2.558509 -0.455317
C  3.056666 0.52497 0.879035
C  3.980229 0.423537 -1.377734
C  4.163448 -0.202885 1.365642
C  5.092467 -0.304754 -0.893119
C  5.187045 -0.620292 0.480965
H  1.743708 2.66996 -0.599914
H  1.833757 1.760202 -2.117594
H  1.140288 -0.747422 -1.302668
H  -3.286134 -1.666322 1.776259
H  1.155485 -2.701387 -0.232171
H  -4.41856 -0.796586 0.1898
H  -2.299073 3.638267 -0.617719
H  -2.201401 -3.849049 2.271913
H  0.028694 -4.403598 1.213764
H  -5.869217 1.170669 -0.250823
H  -4.819049 3.438707 -0.642919
H  2.265187 0.845117 1.567893
H  3.915756 0.671342 -2.445041
H  4.230185 -0.444556 2.432413
H  5.880775 -0.62186 -1.585159
H  6.047122 -1.183691 0.859634
