program: Gaussian 09
title: 000133471
version: EM64L-G09RevD.01
frameworkgroup: C1[X(C20H30O6)]
method: RPBEPBE
basis: SDD
operation: Freq
keyword: #pfreq=noraman
keyword: PBEPBE/SDD
title: #p freq=noraman PBEPBE/SDD
converged: YES YES NO NO
title: Mulliken charges:
elementType: O O O O O O C C C C C C C C C C C C C C C C C C C C H H H H H H H H H H H H H H H H H H H H H H H H H H H H H H
charge: -0.474178 -0.451392 -0.420137 -0.474610 -0.232351 -0.223616 -0.401690 -0.437985 -0.341904 -0.370209 -0.472889 -0.165527 -0.485428 -0.510064 -0.153014 -0.518649 -0.141338 -0.192611 -0.227434 -0.158240 0.179185 0.230577 -0.233594 -0.216576 -0.228284 -0.218254 0.191926 0.238250 0.217069 0.222829 0.253332 0.190757 0.225762 0.229686 0.197090 0.209875 0.191277 0.251198 0.252536 0.275394 0.247941 0.229128 0.227907 0.195096 0.198753 0.224796 0.249529 0.252882 0.383856 0.220970 0.217981 0.223431 0.228599 0.333359 0.375723 0.383281
chargesum: 0.00000
title: Mulliken charges with hydrogens summed into heavy atoms:
elementType: O O O O O O C C C C C C C C C C C C C C C C C C C C
charge: -0.090322 -0.118033 -0.044414 -0.091329 -0.232351 -0.223616 0.028485 0.001912 0.102185 0.085240 -0.065924 0.025750 0.018306 0.013271 0.076114 -0.095646 0.057415 0.032185 0.022095 0.094642 0.179185 0.230577 -0.012624 0.001405 -0.004853 0.010345
polarizability: 3.56344920e+02 -6.84012682e+01 2.58678105e+02 -1.76977604e+01 1.46452084e+01 1.93501455e+02
1716.lowfreq: -5.2447 0.0006 0.0008 0.0009 1.4619 4.9606 13.3776 16.4579 19.8068
frequency: 13.1629 16.1502 19.7951 23.8561 32.9717 40.7459 45.9878 60.0309 64.7166 70.7232 74.0848 79.3931 97.8506 106.3106 114.9395 125.0628 145.4660 151.3613 163.9386 179.0186 192.0698 202.2404 222.2581 229.7086 245.4757 259.6615 274.1252 277.3242 292.3700 298.6809 318.8033 342.1855 352.4188 414.2001 421.1364 431.1406 443.8001 457.4957 478.7853 484.1065 506.6810 510.1362 514.5598 528.5836 554.1424 581.3041 592.9622 596.0834 617.3624 644.7881 672.7195 739.3718 749.8093 767.9602 810.1934 817.8100 821.8490 840.3608 855.0719 875.7016 878.4403 898.7981 903.8304 914.8844 925.3249 935.9615 947.8568 959.1220 966.7237 976.0069 1000.2807 1003.8721 1009.4549 1011.9071 1026.6352 1037.0539 1041.6588 1061.8765 1074.9624 1083.1824 1094.7313 1097.5054 1120.3893 1122.9819 1144.9078 1153.6598 1165.7701 1173.5549 1179.8664 1188.6076 1192.4827 1209.7193 1228.4929 1237.7002 1242.9219 1245.1126 1249.1371 1260.3303 1267.5511 1276.2163 1276.8457 1282.3946 1287.9675 1289.9579 1295.7849 1298.3930 1302.3110 1311.4055 1313.7492 1322.9163 1326.9616 1341.0924 1346.5790 1355.6324 1369.1911 1375.1373 1383.5625 1395.1217 1430.1984 1438.8238 1448.2323 1457.0325 1464.9791 1465.4991 1470.2074 1478.2273 1598.6585 1640.0033 1662.3615 1669.8128 1683.3250 1684.1267 2931.0061 2935.2046 2944.8847 2956.2779 2976.0800 2981.4055 2982.8999 2988.1867 2989.4834 2999.9918 3014.2445 3036.6706 3039.3481 3042.7330 3043.5440 3051.2660 3064.4338 3064.7618 3066.7915 3068.7337 3076.9000 3078.0323 3078.6243 3084.7213 3094.1286 3106.3026 3408.1669 3510.6231 3514.2989 3543.0414
redmass: 6.0947 6.8565 11.9991 8.8462 5.8939 5.7840 3.8737 4.2394 3.6832 2.9129 3.7905 3.1350 5.2154 4.4695 3.0389 4.1222 3.9488 2.2507 2.5263 4.1669 4.3410 2.1572 2.9291 3.1252 3.0253 2.5989 1.2947 3.8088 2.7804 3.1129 2.0228 3.4692 3.4065 3.0902 2.9164 3.2716 3.8570 3.1352 2.7957 1.9532 1.9345 2.7589 3.7999 3.0226 3.0814 3.5774 1.8762 3.6900 1.8332 1.3370 1.1938 1.4907 1.4755 1.8957 1.7257 2.0257 2.1401 1.8981 2.0073 2.3735 2.2841 1.9881 2.0792 2.7433 1.1737 2.2652 5.0448 4.0296 1.1350 1.1664 2.8182 1.9388 2.1126 1.1996 3.0263 2.4509 1.9156 2.0125 2.0553 2.2352 2.3826 2.4610 2.2017 1.9223 1.7314 1.3810 2.2163 1.2525 1.6939 1.3203 1.2948 1.3434 1.2456 1.5471 1.4538 1.2403 1.2301 1.1736 1.2318 1.5227 1.2608 1.3868 1.2455 1.2637 1.2490 1.2165 1.2763 1.2747 1.2224 1.4316 1.3386 1.4193 1.4176 1.6999 1.5233 1.7178 1.5643 1.6854 1.0883 1.0832 1.1053 1.0961 1.0857 1.0725 1.0856 1.0921 5.9723 5.4752 6.1444 8.1808 7.3674 7.0605 1.0836 1.0669 1.0841 1.0604 1.0620 1.0642 1.0653 1.0644 1.0602 1.0628 1.0993 1.0946 1.0931 1.0960 1.0948 1.1004 1.0916 1.0987 1.0949 1.1002 1.0880 1.0921 1.0916 1.0891 1.0884 1.0884 1.0678 1.0639 1.0639 1.0658
irintensity: 0.3384 0.1818 1.4570 0.1501 1.0320 0.3395 0.7682 0.7908 1.4545 0.5537 0.7005 0.9736 0.2204 4.5159 1.2129 2.4905 0.6416 1.3005 3.4536 3.3238 2.1839 0.5074 5.3180 2.3295 1.2635 9.5353 98.6134 1.8703 36.7863 14.6569 11.1372 9.6123 1.9400 16.6594 7.3138 6.2543 5.6423 13.2751 27.1101 17.7423 28.0620 13.0307 10.9441 6.9422 12.3641 0.3766 56.5789 8.4631 111.7485 123.9439 88.7273 9.7515 27.2848 2.7269 0.1723 2.0835 4.2506 2.0795 6.8267 4.2058 5.6656 10.8755 1.5210 30.2059 7.0282 8.6748 82.1285 73.4729 0.9435 96.6363 120.1427 20.2562 34.0416 89.9612 244.5523 142.3911 97.1583 87.0781 7.4288 50.5623 1.7010 17.4551 10.0215 8.8664 13.8226 22.8943 4.5627 1.9002 10.6356 3.2456 13.0093 37.3409 2.5208 1.2147 0.2730 1.3151 15.7871 21.7897 0.8030 1.2128 1.5591 1.8084 9.6065 1.6350 0.5272 2.3356 3.3699 3.6107 3.3309 44.5273 29.7270 0.2870 15.8329 21.0978 10.6201 25.9938 29.8572 59.7859 41.9833 20.9069 8.2614 12.3054 5.2647 2.8779 25.6386 12.0946 0.0540 5.0306 2.2071 218.0583 73.9879 62.5822 59.9904 84.0829 42.0069 29.0220 52.0930 34.2811 7.8756 7.4277 32.3707 16.2899 20.0082 5.2711 11.9979 13.4248 2.6342 35.1601 6.4619 30.4738 2.1684 58.4996 42.1956 10.9004 9.3025 20.0620 43.4245 28.0448 197.1790 18.2842 28.4947 5.5992
temp: 298.150 k
press: 1.00000 atm
elementType: 8 8 8 8 8 8 6 6 6 6 6 6 6 6 6 6 6 6 6 6 6 6 6 6 6 6 1 1 1 1 1 1 1 1 1 1 1 1 1 1 1 1 1 1 1 1 1 1 1 1 1 1 1 1 1 1
symmnumber: 1
zpe: 1217258.6 jmol-1
zpe.correction: 0.463629 hartree
zpe.thermalcorrener: 0.493911 hartree
zpe.thermalcorrenthalpy: 0.494855 hartree
zpe.thermalcorrgfe: 0.397132 hartree
zpe.sumelectzpe: -1229.393882 hartree
zpe.sumelectthermal: -1229.363600 hartree
zpe.sumelectthermalent: -1229.362656 hartree
zpe.sumelectthermalfe: -1229.460379 hartree
dipole: -3.7386 -1.5174 0.1584
dipole: 4.0380
quadrupole: -154.8301 -166.5102 -152.9103
quadrupole: 0.2407 21.7437 -0.4622
quadrupole: 3.2534 -8.4267 5.1732 0.2407 21.7437 -0.4622
hfenergy: -1229.857511 hartree
pointgroup: C01 [X(C20H30O6)]
dipole: -1.5333744 0.4139278 0.0352367 debye
polarizability: 339.6435252|77.7513104|273.8816061|15.6823347|19.6941807|194.9993484 unknown
InChI: InChI=1S/C20H30O6/c21-17(11-6-2-1-3-9-15-19(23)24)12-7-4-5-8-13-18(22)14-10-16-20(25)26/h2,4-8,12-13,17-18,21-23,25H,1,3,9-11,14-16H2
charge 0 multiplicity 1
56 atoms
O  2.595021 3.204645 0.392036
O  -4.041126 -4.851917 -0.604176
O  6.801887 -1.523352 -1.943333
O  0.029023 3.351848 -0.998565
O  7.304184 -1.523187 0.32215
O  -1.809877 2.167789 -1.76276
C  -4.054167 2.128886 0.578633
C  4.494109 1.84407 0.922555
C  -2.67681 1.571939 1.001545
C  5.280444 0.51661 0.848227
C  -5.21942 1.153911 0.909277
C  3.121834 1.827941 0.22221
C  5.687035 0.127317 -0.588268
C  -1.487868 2.503441 0.686069
C  -5.16647 -0.133134 0.11055
C  -5.158124 -2.662202 -0.188305
C  -3.903066 -3.55494 0.095448
C  -5.195287 -1.388638 0.628905
C  2.14728 0.837421 0.814296
C  -2.640288 -2.928432 -0.429158
C  6.663741 -1.031828 -0.632383
C  -1.172289 2.617309 -0.790523
C  1.375608 -0.017082 0.069562
C  -1.695841 -2.319941 0.350063
C  0.320865 -0.863071 0.604211
C  -0.556417 -1.584884 -0.174657
H  -4.238705 3.095506 1.09126
H  -4.04891 2.333414 -0.508775
H  5.087573 2.668262 0.480362
H  4.321999 2.11207 1.982829
H  -2.511353 0.592462 0.517311
H  -2.683793 1.387559 2.094988
H  4.684125 -0.303229 1.292435
H  6.195045 0.601047 1.463484
H  -5.222664 0.923831 1.99372
H  -6.175263 1.675611 0.691908
H  3.246786 1.60946 -0.862319
H  6.171828 0.98486 -1.099082
H  4.814104 -0.140548 -1.210795
H  -0.565526 2.153947 1.187791
H  -1.668556 3.5291 1.067649
H  -5.100485 -0.013194 -0.983248
H  -5.190646 -2.433951 -1.27005
H  -6.057048 -3.276329 0.044697
H  -3.824599 -3.718446 1.192946
H  -5.247316 -1.511177 1.723112
H  2.018625 0.888708 1.906878
H  -2.542206 -2.932578 -1.524424
H  1.675845 3.252956 0.002593
H  1.516591 -0.036432 -1.023793
H  -1.814662 -2.339248 1.444651
H  0.191675 -0.872778 1.697888
H  -0.433985 -1.567318 -1.268423
H  -4.935616 -5.229433 -0.400617
H  7.465331 -2.26625 -1.942581
H  0.182525 3.4499 -1.977505
