program: Gaussian 09
title: 000133455
version: EM64L-G09RevD.01
frameworkgroup: C1[X(C21H32O4)]
method: RPBEPBE
basis: SDD
operation: Freq
keyword: #pfreq=noraman
keyword: PBEPBE/SDD
title: #p freq=noraman PBEPBE/SDD
converged: YES YES NO NO
title: Mulliken charges:
elementType: O O O O C C C C C C C C C C C C C C C C C C C C C H H H H H H H H H H H H H H H H H H H H H H H H H H H H H H H H
charge: -0.446363 -0.438794 -0.198090 -0.433393 0.340444 -0.155534 -0.222965 -0.086029 0.115642 0.260305 -0.534841 -0.192408 -0.547044 -0.552530 -0.487990 -0.820631 0.502843 -0.506164 -0.486374 -0.829427 0.148751 -0.682097 -0.467791 -0.067158 -0.825306 0.240549 0.272402 0.196661 0.182562 0.210688 0.217240 0.236311 0.215708 0.292716 0.241955 0.198520 0.223880 0.290270 0.210125 0.220498 0.209778 0.213348 0.214633 0.229891 0.224860 0.220142 0.243329 0.199435 0.190146 0.228606 0.235151 0.337029 0.332160 0.265763 0.234986 0.262789 0.320814
chargesum: 0.00000
title: Mulliken charges with hydrogens summed into heavy atoms:
elementType: O O O O C C C C C C C C C C C C C C C C C C C C C
charge: -0.109334 -0.106633 -0.198090 -0.112579 0.340444 0.085015 0.049437 0.110632 0.115642 0.260305 -0.141592 0.024832 -0.095024 -0.017859 -0.065589 -0.099739 0.502843 -0.083039 -0.271741 -0.154535 0.148751 -0.239332 -0.049039 0.167993 -0.061768
polarizability: 2.84324183e+02 -1.77629715e+00 2.16416769e+02 2.79426944e+00 -2.51200982e+00 1.84005859e+02
1716.lowfreq: -8.5775 -7.9339 -0.0009 -0.0003 0.0008 5.9323 32.5163 44.2212 59.3843
frequency: 32.4709 44.1149 59.3438 72.8044 83.4918 92.4334 120.0864 162.3774 173.5906 175.6750 182.6127 190.4411 196.2794 217.5662 237.4894 240.6220 253.8436 265.5961 273.2333 283.0755 290.6647 294.8331 297.5360 310.7727 320.7794 340.1058 343.0875 359.9690 367.6687 383.6505 392.2371 418.4330 428.8348 443.3635 447.2827 456.5485 457.4701 482.9916 499.9114 537.4180 570.9217 579.3954 589.2418 609.0911 623.9323 649.0748 697.9026 709.4937 754.7187 790.8818 795.4007 813.3087 830.8450 834.8576 837.6497 860.5323 880.5331 891.3419 910.6210 923.4158 933.4986 944.2958 947.6130 961.6875 978.2765 981.2260 990.6138 994.7789 1009.4671 1016.1038 1017.6928 1029.4320 1037.3796 1043.9889 1059.7446 1072.5246 1089.8425 1105.9551 1116.1783 1126.3747 1127.5918 1136.3220 1142.6918 1150.8855 1157.7941 1170.0698 1182.2864 1185.2579 1193.4007 1196.1028 1205.2832 1214.4320 1233.4914 1241.2805 1249.0131 1255.4660 1270.1102 1274.8935 1282.2015 1294.7894 1299.4477 1304.7441 1318.1405 1322.6739 1326.3562 1330.9128 1333.6046 1340.6357 1342.4314 1344.7690 1351.1844 1355.7454 1361.3112 1365.1622 1371.5303 1373.4192 1386.3470 1411.9624 1447.2613 1451.1289 1454.1058 1455.2012 1456.7426 1458.2066 1460.2908 1468.2203 1470.5243 1474.5447 1480.6785 1490.2785 1502.4011 1621.7349 1683.2579 2921.7633 2929.2457 2934.0038 2938.2424 2949.8106 2963.2503 2965.2454 2966.2525 2978.9223 2982.7670 2985.2177 2988.4569 2990.6785 2993.1024 3011.3842 3029.5205 3031.8245 3036.9155 3043.3914 3049.7280 3055.4618 3064.1097 3071.7316 3074.1376 3079.8210 3089.6813 3105.0048 3116.9671 3120.7009 3540.0011 3548.7234 3554.9772
redmass: 5.1787 3.6776 3.7121 4.2799 4.7349 4.6388 3.1001 3.9245 2.0604 3.5203 1.7263 1.3455 1.9547 1.5113 1.7241 2.5894 2.3833 2.6598 1.8391 1.7781 2.1651 2.1040 1.8430 2.4181 3.7032 2.1112 2.4118 1.4382 2.7110 2.9465 3.3855 3.4471 3.4641 3.4209 2.0410 2.3231 3.1908 3.4078 2.8781 4.0900 3.6228 2.9908 3.3852 3.4665 2.8317 3.0529 3.2827 3.2917 3.1997 2.0900 1.8923 2.6792 2.3284 1.6514 2.5800 3.1408 1.7473 2.3423 2.0527 2.3393 1.7023 1.9948 2.0225 2.0810 2.5546 2.2252 2.2596 2.3849 2.0164 2.0074 2.0657 1.8165 2.0415 2.0848 2.4137 2.3017 3.0402 1.8065 2.0042 2.0108 2.3495 1.9530 1.9241 1.4792 1.7342 1.8909 1.8755 1.4805 2.0602 2.1611 1.3511 1.9287 1.6771 1.5421 1.3641 1.6550 1.4573 1.4809 1.5855 1.4207 1.3119 1.4823 1.5573 1.4293 1.4177 1.4066 1.3838 1.3254 1.4821 1.5785 1.4043 1.5504 1.3778 1.2415 1.3471 1.2685 1.2366 1.1785 1.0762 1.0787 1.0712 1.0836 1.0888 1.0662 1.0744 1.0885 1.0764 1.0794 1.0641 1.0550 1.0583 8.5851 7.8180 1.0813 1.0621 1.0674 1.0790 1.0588 1.0654 1.0888 1.0633 1.0379 1.0381 1.0824 1.0482 1.0712 1.0752 1.0975 1.0895 1.0937 1.0608 1.0945 1.1008 1.0957 1.0954 1.0975 1.0988 1.0973 1.0901 1.1035 1.0971 1.0995 1.0657 1.0652 1.0658
irintensity: 1.8126 2.2321 2.6885 0.2644 0.2356 2.9991 0.0877 1.1668 2.1745 0.5980 0.6733 3.8908 0.9091 0.7346 0.5183 11.9019 13.4492 7.3102 8.6285 42.8715 65.1948 29.1001 76.8212 3.4481 29.0920 47.0053 59.7581 107.2661 11.1824 2.3024 2.8859 7.1863 6.6280 3.4619 7.9897 15.8272 6.7059 3.8560 4.9293 3.3584 11.9296 5.3794 5.8715 3.3234 3.4316 3.6288 1.4678 1.5244 4.6942 2.8117 14.6107 12.1398 22.0209 21.1440 2.4431 3.8894 1.7282 3.7834 20.5166 3.6073 4.5653 7.1048 13.9514 17.5311 55.8850 8.0212 23.4750 22.1070 10.5794 7.4098 30.8705 11.8825 16.3062 16.4884 26.5525 9.1418 25.3867 4.9541 6.0350 9.4019 6.9644 11.2371 7.2518 0.6473 10.0978 12.8172 12.9031 17.7780 26.0724 60.1784 21.6438 17.4554 15.6554 4.4332 1.0546 7.1468 30.9814 12.7475 45.3266 6.7473 8.4432 1.1223 12.1585 1.4707 6.0920 0.8497 3.1314 4.1207 1.2123 1.0855 2.8988 4.2679 7.3078 65.7357 9.7085 27.4271 20.0259 24.3503 16.0577 22.6788 2.3772 17.1090 12.1509 4.5213 3.1119 7.7871 7.5372 2.1909 27.7456 2.8820 13.2715 94.7834 3.0748 10.6783 46.3505 33.3910 4.7937 51.1765 17.8311 8.9653 48.4168 5.0421 21.2155 59.0453 2.0015 39.3964 43.7438 41.2559 14.3908 53.7392 12.5988 32.3938 34.2861 55.6594 9.7139 54.5595 19.8643 41.4118 43.3805 8.8946 4.5270 11.5257 7.9956 3.4596 1.0856
temp: 298.150 k
press: 1.00000 atm
elementType: 8 8 8 8 6 6 6 6 6 6 6 6 6 6 6 6 6 6 6 6 6 6 6 6 6 1 1 1 1 1 1 1 1 1 1 1 1 1 1 1 1 1 1 1 1 1 1 1 1 1 1 1 1 1 1 1 1
symmnumber: 1
zpe: 1290351.3 jmol-1
zpe.correction: 0.491469 hartree
zpe.thermalcorrener: 0.516472 hartree
zpe.thermalcorrenthalpy: 0.517416 hartree
zpe.thermalcorrgfe: 0.439721 hartree
zpe.sumelectzpe: -1118.350245 hartree
zpe.sumelectthermal: -1118.325241 hartree
zpe.sumelectthermalent: -1118.324297 hartree
zpe.sumelectthermalfe: -1118.401993 hartree
dipole: 2.0074 -2.6043 -0.6730
dipole: 3.3563
quadrupole: -188.9396 -143.3048 -155.9230
quadrupole: 10.3371 21.8089 -0.6535
quadrupole: -26.2171 19.4176 6.7995 10.3371 21.8089 -0.6535
hfenergy: -1118.8417136 hartree
pointgroup: C01 [X(C21H32O4)]
dipole: 0.789194 -1.0224878 -0.2745411 debye
polarizability: 284.2996699|-1.9015463|216.4780549|3.0964497|-2.1305871|183.9690864 unknown
InChI: InChI=1S/C21H32O4/c1-12(22)21(25)11-17(24)18-15-5-4-13-10-14(23)6-8-19(13,2)16(15)7-9-20(18,21)3/h4,14-18,23-25H,5-11H2,1-3H3
charge 0 multiplicity 1
57 atoms
O  -3.474029 -0.383966 -1.973457
O  -2.117956 2.69825 1.046159
O  -5.300786 -0.355126 1.122376
O  6.773974 -0.26998 -0.338786
C  -2.094834 -0.397796 0.161977
C  -1.271328 0.794157 -0.415646
C  0.180477 0.876163 0.092184
C  0.911286 -0.472052 -0.208411
C  -3.502529 -0.086775 -0.518175
C  2.387906 -0.487611 0.34988
C  -1.384897 -1.703571 -0.275063
C  -2.193817 2.032918 -0.276451
C  0.083832 -1.713737 0.234746
C  -3.627174 1.457665 -0.417272
C  0.936034 2.037527 -0.597959
C  -2.25022 -0.360906 1.705553
C  3.098538 0.838728 0.008593
C  3.170546 -1.655047 -0.348435
C  2.435764 1.94357 -0.428782
C  2.412694 -0.691115 1.897167
C  -4.69065 -0.833975 0.130533
C  4.613655 0.870658 0.181526
C  4.696796 -1.643445 -0.100126
C  5.312975 -0.304104 -0.540899
C  -5.105723 -2.167596 -0.480375
H  -1.215399 0.61048 -1.512543
H  0.183818 1.053422 1.186471
H  1.000173 -0.522168 -1.318927
H  -1.36371 -1.779523 -1.383345
H  -1.905014 -2.600964 0.117263
H  -1.969071 2.780096 -1.063718
H  0.070625 -1.787038 1.336969
H  0.575918 -2.633794 -0.13355
H  -4.219821 1.733035 0.470357
H  -4.144363 1.833978 -1.31487
H  0.587528 3.017375 -0.207486
H  0.682396 2.049124 -1.681549
H  -2.811803 0.523948 2.040333
H  -2.779098 -1.263358 2.064836
H  -1.267597 -0.330821 2.205698
H  2.992727 -1.589021 -1.441979
H  2.756857 -2.625593 -0.015055
H  3.017884 2.842954 -0.679166
H  1.73144 0.017008 2.401946
H  2.113974 -1.718149 2.17508
H  3.421889 -0.521116 2.310701
H  5.02362 1.827124 -0.18949
H  4.87954 0.804981 1.260466
H  4.913976 -1.805717 0.976887
H  5.179244 -2.470702 -0.653444
H  5.206806 -0.185373 -1.634478
H  -3.207524 -1.328769 -2.111935
H  -1.230389 3.130817 1.13173
H  -5.568404 -1.996367 -1.470235
H  -4.237859 -2.837578 -0.633267
H  -5.837011 -2.661341 0.177726
H  6.956812 -0.380282 0.630016
