program: Gaussian 09
title: 000133422
version: EM64L-G09RevD.01
frameworkgroup: C1[X(C17H17N5O2)]
method: RPBEPBE
basis: SDD
operation: Freq
keyword: #p
keyword: freq=noraman
keyword: PBEPBE/SDD
title: #p freq=noraman PBEPBE/SDD
converged: YES YES NO NO
title: Mulliken charges:
elementType: O O N N N N N C C C C C C C C C C C C C C C C C H H H H H H H H H H H H H H H H H
charge: -0.314760 -0.251777 -0.135247 -0.630664 -0.640647 -0.652018 -0.367526 0.217748 0.380567 0.512065 -0.423962 -0.333788 -0.360915 -0.402287 -0.341631 -0.316581 0.247270 0.142206 -0.400065 -0.361558 -0.281349 -0.260653 0.206568 0.141376 0.251819 0.305812 0.234260 0.223962 0.263870 0.263078 0.259954 0.250645 0.187201 0.243548 0.340934 0.308637 0.313108 0.356246 0.313378 0.306994 0.204181
chargesum: 0.00000
title: Mulliken charges with hydrogens summed into heavy atoms:
elementType: O O N N N N N C C C C C C C C C C C C C C C C C
charge: -0.314760 -0.251777 -0.135247 0.018907 0.028707 -0.031646 -0.163346 0.217748 0.380567 0.512065 -0.172143 -0.027975 -0.126655 -0.178324 -0.077760 -0.053503 0.247270 0.142206 -0.140111 -0.110913 -0.094148 -0.017105 0.206568 0.141376
polarizability: 6.06478981e+02 9.89565760e+00 2.22420310e+02 1.40567129e+00 4.49361429e+00 1.01793455e+02
1716.lowfreq: -18.8338 -5.7763 -3.0824 -0.0013 0.0008 0.0011 1.3964 14.7408 17.9145
frequency: -17.0301 14.4194 17.8117 33.8885 39.4735 64.9759 72.6449 79.9328 92.0523 110.2638 121.8289 142.7832 160.4042 198.5736 206.0037 228.7914 272.6806 302.2180 318.8345 336.1805 346.7484 376.7551 380.3214 403.5374 404.5806 413.2319 415.4492 430.4837 464.0369 488.4969 490.1610 506.1031 511.5791 525.3193 548.5483 551.0304 583.3503 624.2869 628.2765 632.2906 653.1929 672.1811 677.1540 735.1977 746.2466 753.3795 775.2275 816.6162 817.7260 831.6130 837.7657 843.5334 845.1732 862.3122 880.1076 914.6391 949.5796 957.5942 974.2105 980.7027 981.3185 987.7110 990.8909 1004.4746 1020.5533 1025.6200 1044.5110 1086.9514 1101.5314 1112.2926 1117.2483 1153.4210 1176.6714 1206.1363 1229.2422 1246.1037 1267.6600 1294.0791 1294.5886 1317.5486 1320.1646 1350.6437 1375.1897 1406.9689 1423.5525 1432.4803 1447.0507 1490.6485 1496.3954 1542.3740 1564.4877 1571.6756 1602.0710 1603.7285 1613.8268 1622.6403 1623.5205 1630.2567 1652.4370 1671.2995 3066.3421 3121.8950 3124.6170 3145.1004 3154.1765 3155.4232 3159.6730 3169.1895 3180.8887 3211.7900 3304.2433 3530.6150 3543.0747 3555.5259 3671.1626 3686.8263 3707.4524
redmass: 3.8585 5.6861 3.7295 6.4875 5.9600 5.8171 4.6021 5.7151 5.7205 5.2907 2.0945 6.1655 6.0320 3.8959 3.5954 1.4561 5.5341 5.5228 5.3994 6.3865 1.7120 3.0685 2.6083 2.8897 1.1039 2.9293 2.9983 1.4738 2.8844 1.5782 2.5038 2.6796 2.6899 3.6880 3.4592 1.0979 5.0230 6.8688 3.3692 6.8935 6.2657 5.4605 6.2862 3.6880 8.2517 4.9260 5.4749 1.4322 6.4060 1.3073 1.5263 3.7280 1.3851 1.7137 2.0073 3.7322 4.2096 1.2407 1.2517 1.3220 1.3442 1.5866 3.0318 2.8788 3.3209 1.4092 1.4653 1.8312 1.5530 1.3426 1.3656 2.0945 1.1496 1.4611 1.8992 3.4123 1.6777 1.3223 1.4379 1.4093 3.4600 4.1966 3.5218 4.0288 3.5910 4.6252 3.9278 2.5616 2.7873 7.4861 4.7781 5.9509 4.5323 1.4053 5.5286 1.5292 6.3008 1.2594 5.5461 3.3374 1.0894 1.0909 1.0882 1.0879 1.0941 1.0901 1.0899 1.0965 1.0963 1.0942 1.0758 1.0453 1.0449 1.0452 1.1038 1.1035 1.1046
irintensity: 17.4165 1.3292 0.8104 2.3439 1.3238 4.5285 2.8416 0.9590 2.6404 14.1292 0.1625 9.4977 13.4587 16.7621 13.1533 99.9767 4.2540 6.6100 25.6866 1.8819 86.6733 72.2925 32.8770 32.4546 128.0001 2.4599 15.8199 177.4119 12.6196 43.1591 19.8527 22.8624 33.9476 33.3577 8.2316 229.8961 6.9280 3.9961 13.3227 1.8755 44.0129 41.8312 55.0651 1.2039 26.0329 14.1921 11.7069 103.4424 3.0787 5.1570 8.1176 13.8459 5.9541 57.8584 39.3357 8.2510 96.7785 42.1493 22.6814 7.6826 13.9687 83.7723 209.3971 1.7724 541.3046 20.9925 4.6338 60.1386 221.2323 5.4218 56.1315 772.8862 174.9191 236.3606 246.6111 388.9211 4.6949 1.3523 3.2470 4.9836 79.3504 0.4244 5.1462 68.1522 112.1668 20.2963 156.8654 207.2227 58.1470 27.2015 102.3937 45.2820 1183.0667 388.1999 30.0882 28.2169 130.7496 189.5752 34.8184 1069.7789 47.3172 21.8865 9.9351 12.2523 6.9051 6.9214 7.9027 7.1064 5.4401 3.6317 32.3952 24.3933 15.7772 109.3104 47.1320 25.1772 36.2897
temp: 298.150 k
press: 1.00000 atm
elementType: 8 8 7 7 7 7 7 6 6 6 6 6 6 6 6 6 6 6 6 6 6 6 6 6 1 1 1 1 1 1 1 1 1 1 1 1 1 1 1 1 1
symmnumber: 1
zpe: 829313.9 jmol-1
zpe.correction: 0.315869 hartree
zpe.thermalcorrener: 0.338269 hartree
zpe.thermalcorrenthalpy: 0.339213 hartree
zpe.thermalcorrgfe: 0.261609 hartree
zpe.sumelectzpe: -1080.514475 hartree
zpe.sumelectthermal: -1080.492075 hartree
zpe.sumelectthermalent: -1080.491131 hartree
zpe.sumelectthermalfe: -1080.568735 hartree
dipole: 6.6551 2.5053 2.1469
dipole: 7.4280
quadrupole: -40.5194 -141.3517 -144.5615
quadrupole: -27.3760 15.7358 3.1754
quadrupole: 68.2915 -32.5409 -35.7506 -27.3760 15.7358 3.1754
hfenergy: -1080.8303438 hartree
pointgroup: C01 [X(C17H17N5O2)]
dipole: 2.6042365 -0.0397619 -1.3254553 debye
polarizability: 606.2482908|4.304153|157.1747845|-14.4911887|60.0522902|167.2696703 unknown
InChI: InChI=1S/C17H17N5O2/c18-15(19)10-3-11-1-8-14(9-2-11)24-16(23)12-4-6-13(7-5-12)22-17(20)21/h1-10,18H,19-21H2
charge 0 multiplicity 1
41 atoms
O  0.043993 -0.064876 0.112014
O  0.73336 -1.65538 -1.492692
N  6.361002 0.600447 0.941935
N  8.636203 1.036099 0.743535
N  7.389576 0.834681 -1.242114
N  -8.633208 -0.443785 -0.384016
N  -8.67518 1.310385 1.289785
C  2.382113 -0.412465 -0.201355
C  -1.361002 -0.191895 -0.040321
C  -4.2084 -0.201527 -0.095144
C  -2.093994 0.67536 0.808801
C  -2.033764 -1.071047 -0.92286
C  -3.495974 0.670371 0.781331
C  -3.444022 -1.059576 -0.933454
C  3.48113 -1.067258 -0.822141
C  2.643059 0.568394 0.798606
C  5.07407 0.26558 0.510792
C  1.019149 -0.8009 -0.618322
C  4.801489 -0.739147 -0.478214
C  3.959897 0.894029 1.150751
C  -5.677125 -0.251006 -0.16691
C  -6.555031 0.508763 0.556897
C  7.40158 0.792557 0.152586
C  -8.032167 0.465831 0.493293
H  -1.542872 1.341142 1.47986
H  -1.469929 -1.737414 -1.575178
H  -4.040953 1.347889 1.446457
H  -3.966608 -1.740661 -1.617032
H  3.271856 -1.840037 -1.56991
H  1.801366 1.06439 1.28892
H  5.633599 -1.296141 -0.92574
H  4.168789 1.638865 1.924733
H  -6.065088 -0.98645 -0.88925
H  -6.204403 1.251474 1.280637
H  8.655074 1.042187 1.760506
H  9.507356 0.949563 0.227512
H  8.137264 1.29423 -1.757473
H  6.507012 0.675905 -1.724989
H  -9.646828 -0.496736 -0.449687
H  -8.085888 -1.070912 -0.9679
H  -9.712703 1.23977 1.20685
