program: Gaussian 09
title: 000133385
version: EM64L-G09RevD.01
frameworkgroup: C1[X(C24H16O2)]
method: RPBEPBE
basis: SDD
operation: Freq
keyword: #pfreq=noraman
keyword: PBEPBE/SDD
title: #p freq=noraman PBEPBE/SDD
converged: YES YES NO NO
title: Mulliken charges:
elementType: O O C C C C C C C C C C C C C C C C C C C C C C C C H H H H H H H H H H H H H H H H
charge: -0.426414 -0.416249 0.015930 0.010225 0.328378 0.481782 0.127664 0.506508 -0.376097 0.338776 0.524704 -0.755188 -0.222132 -0.488450 0.154599 -0.288757 -0.478930 -0.507053 -0.507015 0.466546 -0.195266 -0.823899 -0.346692 -0.460656 -0.261979 -0.251704 0.207582 0.244202 0.187842 0.224732 0.214464 0.223366 0.243455 0.243488 0.225228 0.246220 0.224506 0.245427 0.331746 0.331377 0.227881 0.229855
chargesum: 0.00000
title: Mulliken charges with hydrogens summed into heavy atoms:
elementType: O O C C C C C C C C C C C C C C C C C C C C C C C C
charge: -0.094668 -0.084871 0.015930 0.010225 0.328378 0.481782 0.127664 0.506508 -0.168515 0.338776 0.524704 -0.510986 -0.034290 -0.263718 0.154599 -0.074294 -0.255564 -0.263598 -0.263528 0.466546 0.029962 -0.577679 -0.122186 -0.215230 -0.034098 -0.021849
polarizability: 5.93216009e+02 2.58065372e+00 2.88309951e+02 2.42046295e+00 8.46550880e+00 1.17588017e+02
1716.lowfreq: -8.7526 -7.9648 -0.0004 -0.0001 0.0008 0.4571 34.6228 42.4935 64.8083
frequency: 34.5584 42.4269 64.8027 85.4087 114.0691 137.1344 161.7077 180.5355 212.1794 218.2257 231.9369 258.2369 265.1688 277.2323 284.3477 314.7552 333.4004 372.2799 399.1182 400.7068 410.7807 455.5018 464.0610 488.0908 498.5286 516.1806 527.5514 537.9648 548.2720 551.1546 555.7221 574.0384 619.7405 633.3407 637.8907 679.4502 686.4173 689.4918 734.0391 758.1205 775.4610 787.0457 794.4553 815.6666 820.5140 842.0453 856.3077 865.8370 868.4513 870.8629 878.1455 900.9522 915.7634 940.4600 949.6236 960.1116 968.4737 973.1813 980.3708 986.6249 991.4785 999.0975 1026.9563 1035.2794 1058.4736 1099.8437 1122.5394 1145.8736 1163.5756 1172.1236 1172.7582 1179.5646 1187.8974 1206.0576 1214.5974 1242.6502 1261.4215 1270.0127 1280.9842 1290.5477 1302.3415 1321.9438 1328.9950 1343.4569 1353.3883 1393.2136 1397.9135 1406.3882 1416.9252 1418.3618 1425.7604 1444.0586 1447.9383 1471.5697 1480.4081 1497.0306 1523.8386 1562.5058 1577.7618 1596.1576 1611.4478 1624.2008 1631.5619 1644.8258 2914.3056 2923.8059 3117.8060 3120.0801 3122.3372 3122.6720 3133.8014 3136.5126 3144.9495 3146.0326 3152.6869 3164.0546 3166.4968 3173.1507 3515.9918 3517.8610
redmass: 5.8594 5.1868 4.8683 4.3094 4.6593 5.2180 4.4309 4.3396 4.2234 4.2586 1.2682 3.9603 2.3579 1.7083 4.1720 4.8556 4.0162 4.9026 4.7081 5.8596 3.9425 4.0247 3.9840 5.5861 4.5840 4.5414 5.4586 3.7753 4.3919 4.1513 4.6140 3.9742 5.3000 6.1771 6.2471 4.8664 4.4016 3.6423 2.1146 1.2969 2.2846 4.3821 2.2897 4.1052 1.4643 5.7427 1.7828 2.4532 5.0102 1.8523 4.6946 3.2071 2.3555 2.2131 5.7509 1.4728 1.7947 2.3886 1.4141 1.4607 1.4142 3.6148 3.7019 2.9469 2.5853 2.0227 2.7890 1.6629 1.2791 1.1355 1.0908 1.1301 1.2130 1.2751 1.3756 1.6981 1.7959 1.6672 1.2156 2.1544 1.6885 2.4823 3.1346 2.1557 1.7584 1.8337 4.5097 3.3966 2.5079 2.6161 6.6717 3.2112 3.9393 3.3031 4.0570 5.2510 4.1335 5.9498 7.5321 6.2445 6.5887 6.7274 6.9014 7.1357 1.0827 1.0847 1.0903 1.0879 1.0896 1.0873 1.0880 1.0855 1.0984 1.0883 1.0918 1.0991 1.0983 1.0949 1.0660 1.0657
irintensity: 1.1721 0.1111 0.1273 0.0632 0.2849 1.2535 5.7054 3.0259 3.6118 3.5849 110.1629 15.8634 68.6698 136.8296 2.2074 3.5908 15.4418 2.0240 0.2675 2.1801 6.3794 4.5024 0.1128 4.4800 1.3925 1.4022 0.0848 5.3305 2.6534 9.5169 1.9022 12.1157 9.5677 1.3052 4.0972 9.3159 23.6803 5.1025 29.4402 64.7890 24.7064 8.2086 28.2334 15.5464 3.3397 1.0802 2.8105 0.9205 5.7240 5.6809 1.7122 11.6966 65.0091 68.0069 65.1290 6.6904 32.9470 25.8844 3.5945 0.4126 1.4689 25.0005 4.1843 4.3328 4.9129 8.5186 2.8072 8.9190 21.1626 63.6653 18.1914 1.9798 9.8656 0.8389 3.4759 13.4284 4.9097 3.1667 0.4298 1.9314 0.3030 6.4570 1.6830 3.8118 26.6695 8.6775 4.5115 1.7685 3.6339 1.0099 0.4236 1.0145 6.1414 12.6770 1.6637 0.3378 0.8895 1.4917 1.2467 0.7864 1.1747 2.3061 4.5065 13.0362 94.6285 84.6866 2.9791 2.9432 11.9790 3.4900 7.7963 0.5438 34.8984 10.3869 24.2825 13.0618 37.8569 49.2016 4.7876 12.8658
temp: 298.150 k
press: 1.00000 atm
elementType: 8 8 6 6 6 6 6 6 6 6 6 6 6 6 6 6 6 6 6 6 6 6 6 6 6 6 1 1 1 1 1 1 1 1 1 1 1 1 1 1 1 1
symmnumber: 1
zpe: 853064.2 jmol-1
zpe.correction: 0.324915 hartree
zpe.thermalcorrener: 0.344121 hartree
zpe.thermalcorrenthalpy: 0.345065 hartree
zpe.thermalcorrgfe: 0.278118 hartree
zpe.sumelectzpe: -1072.891487 hartree
zpe.sumelectthermal: -1072.872281 hartree
zpe.sumelectthermalent: -1072.871336 hartree
zpe.sumelectthermalfe: -1072.938284 hartree
dipole: -1.5711 0.9603 0.0804
dipole: 1.8431
quadrupole: -106.6611 -129.6744 -163.4521
quadrupole: -7.8037 1.4405 6.3794
quadrupole: 26.6015 3.5881 -30.1896 -7.8037 1.4405 6.3794
hfenergy: -1073.2164015 hartree
pointgroup: C01 [X(C24H16O2)]
dipole: -0.6178128 0.3781132 0.0341493 debye
polarizability: 593.2297089|2.4370097|288.2865468|0.8371723|8.6615485|117.5977212 unknown
InChI: InChI=1S/C24H16O2/c25-21-10-9-17-19-8-7-18-16-4-2-1-3-13(16)11-14-5-6-15(23(19)22(14)18)12-20(17)24(21)26/h1-12,21,24-26H
charge 0 multiplicity 1
42 atoms
O  -4.912414 0.795764 -1.640997
O  -5.55534 -0.67576 1.779691
C  -0.277381 0.484742 -0.01317
C  1.164909 0.480791 0.013495
C  -1.015789 -0.752552 -0.101187
C  -3.13139 0.523695 -0.072825
C  -2.456345 -0.72822 -0.129211
C  -0.991005 1.7371 0.053422
C  -4.641507 0.576742 -0.196752
C  1.892908 -0.753412 -0.047044
C  1.883064 1.743801 0.104459
C  -2.406599 1.724512 0.022994
C  -5.369807 -0.69798 0.305813
C  -0.25425 -1.974939 -0.150698
C  3.347133 -0.741532 -0.023517
C  -3.261938 -1.954922 -0.193586
C  1.132292 -1.973396 -0.127381
C  -0.248976 2.976792 0.144823
C  1.129931 2.980497 0.16877
C  4.038228 0.530432 0.065846
C  -4.612673 -1.962689 -0.003995
C  3.286766 1.741386 0.128896
C  4.14134 -1.932765 -0.085397
C  5.473911 0.556066 0.090365
C  5.538385 -1.880285 -0.060389
C  6.214738 -0.623637 0.028637
H  -5.030079 1.444428 0.384506
H  -2.949442 2.677158 0.055312
H  -6.369751 -0.728836 -0.187109
H  -0.773393 -2.935658 -0.204499
H  -2.758027 -2.908556 -0.379203
H  1.654246 -2.933442 -0.169513
H  -0.811185 3.916576 0.19264
H  1.685632 3.922904 0.237044
H  -5.178154 -2.900041 -0.015225
H  3.825319 2.694853 0.198209
H  3.654803 -2.910182 -0.15494
H  5.979673 1.52653 0.158949
H  -5.894305 0.873989 -1.772297
H  -6.165926 0.072848 2.012201
H  6.120499 -2.807052 -0.10972
H  7.309502 -0.593853 0.04758
