program: Gaussian 09
title: 000133372
version: EM64L-G09RevD.01
frameworkgroup: C1[X(C18H34O3)]
method: RPBEPBE
basis: SDD
operation: Freq
keyword: #pfreq=noraman
keyword: PBEPBE/SDD
title: #p freq=noraman PBEPBE/SDD
converged: YES YES NO NO
title: Mulliken charges:
elementType: O O O C C C C C C C C C C C C C C C C C C H H H H H H H H H H H H H H H H H H H H H H H H H H H H H H H H H H
charge: -0.460280 -0.437213 -0.252319 -0.066232 -0.447670 -0.407544 -0.391373 -0.385599 -0.401486 -0.374256 -0.410779 -0.377994 -0.377998 -0.357922 -0.381659 -0.363365 -0.458966 -0.693425 -0.078101 -0.334158 0.172265 0.187757 0.226192 0.180814 0.204669 0.215587 0.198662 0.201473 0.191891 0.197575 0.238495 0.199180 0.193138 0.192900 0.197550 0.199588 0.186810 0.191016 0.191703 0.201513 0.185124 0.213178 0.207775 0.217770 0.330366 0.194614 0.194203 0.214794 0.209023 0.212753 0.215299 0.199087 0.261736 0.258075 0.375762
chargesum: 0.00000
title: Mulliken charges with hydrogens summed into heavy atoms:
elementType: O O O C C C C C C C C C C C C C C C C C C
charge: -0.129915 -0.061451 -0.252319 0.121525 -0.040664 0.012713 0.008762 0.003867 0.036189 0.011782 -0.013641 -0.000168 0.015218 0.040380 0.043886 0.025452 -0.035148 -0.066285 0.183635 -0.076083 0.172265
polarizability: 2.69750376e+02 -8.91801804e+00 1.94329524e+02 5.11265369e-01 4.35998400e+00 1.65387683e+02
1716.lowfreq: -9.4865 -0.0008 -0.0007 -0.0005 3.7822 7.9893 14.9981 15.5079 17.9549
frequency: 11.5209 15.4336 17.3652 34.2951 35.5866 43.0832 52.3321 62.5665 67.3928 82.5267 96.2075 99.7715 125.8136 132.9462 137.1070 152.2019 157.2018 177.2698 183.7853 194.0687 196.4958 216.5232 227.8370 239.3887 253.3195 293.8937 298.4964 329.4841 371.4549 385.0615 408.4564 415.4197 467.3009 471.5005 486.7883 501.5096 583.8091 585.7377 608.2997 688.5650 717.5116 720.6145 727.2779 743.6139 749.7185 784.1732 797.2350 822.1933 845.7638 857.3244 870.3237 886.6150 894.7022 918.1470 935.3211 941.8538 980.3255 986.1566 991.3006 1005.2733 1007.7611 1013.5536 1021.1208 1032.0797 1038.5658 1058.7274 1065.2020 1070.6760 1078.5697 1080.6032 1084.0964 1107.0031 1111.4724 1119.6229 1133.7124 1151.6934 1174.4255 1185.3952 1201.4621 1214.2437 1222.1319 1225.0467 1239.2672 1252.6941 1255.2942 1258.5836 1271.7197 1280.2671 1280.9516 1285.3883 1287.9812 1291.6593 1293.6513 1298.2881 1299.3806 1308.7906 1316.5913 1322.9019 1338.2151 1342.0528 1344.8972 1353.1308 1353.6317 1355.1748 1358.1790 1373.3049 1384.9447 1389.1407 1457.2901 1459.1291 1459.5493 1459.8547 1462.3131 1464.3140 1468.2183 1470.0877 1472.0645 1473.9448 1478.9041 1483.0002 1485.3061 1488.2282 1490.1421 1641.1858 1659.8892 2916.6320 2946.2459 2949.2920 2951.1197 2952.8789 2955.7058 2958.8725 2961.1699 2961.5848 2966.3511 2967.3860 2968.3163 2975.7923 2982.1504 2985.0921 2988.7241 2990.8148 2997.3632 3005.4315 3008.4812 3020.3598 3022.8009 3027.3012 3029.7850 3034.3846 3042.4359 3050.3629 3058.2106 3062.3760 3069.8490 3093.8405 3152.1615 3520.2218 3556.0904
redmass: 2.8542 4.6886 5.2059 3.3450 4.3852 3.6206 3.0206 3.7956 3.8483 1.6759 2.8633 2.1103 3.2649 1.7940 2.6842 2.7859 2.9684 3.3782 2.6672 2.7707 3.3920 2.7775 1.1414 2.9304 2.4314 1.2555 2.2122 2.6916 2.9076 3.0388 2.9380 3.1844 2.8085 3.6150 2.7168 2.9987 2.3595 1.3396 4.0113 3.2618 1.1928 1.0675 1.0837 1.1745 1.2017 1.2837 1.4564 2.1223 1.7570 1.7726 1.7058 1.9270 2.5442 2.2851 2.5974 1.3973 1.7513 3.4778 1.7303 2.0335 1.4113 2.0930 2.1520 2.4380 2.9495 1.6148 2.6733 2.2446 1.5256 2.0849 2.0917 2.1959 1.7844 2.3494 1.9775 1.6746 1.4111 1.6943 1.3697 1.2752 1.4204 1.4056 1.2767 1.3016 1.3220 1.3323 1.1957 1.1587 1.0801 1.1358 1.2490 1.2596 1.0801 1.1249 1.1266 1.4097 1.3254 1.2807 1.3976 1.7408 1.4875 1.4748 1.6524 1.5238 1.6102 1.6208 1.2192 1.5131 1.0792 1.0738 1.0809 1.0762 1.0912 1.0779 1.0650 1.0823 1.0795 1.0493 1.0799 1.0890 1.0974 1.0886 1.0928 8.6000 6.1650 1.0832 1.0589 1.0589 1.0606 1.0625 1.0605 1.0594 1.0611 1.0601 1.0595 1.0613 1.0365 1.0619 1.0962 1.0638 1.0703 1.0914 1.0984 1.0970 1.1016 1.0951 1.1015 1.0992 1.0984 1.1026 1.1028 1.1031 1.1016 1.1000 1.0996 1.0911 1.0926 1.0640 1.0659
irintensity: 0.2279 0.0587 0.2600 0.1778 0.2144 0.1631 0.1267 0.1623 0.1918 0.0449 0.5058 0.3759 0.6214 0.2354 1.4558 0.3889 2.6927 3.2600 2.1846 1.2623 0.0102 1.4493 0.0377 1.9469 0.4011 113.4805 26.4310 3.8753 0.7251 7.6049 4.2025 2.0960 5.4691 28.9510 5.1394 5.8791 7.6108 126.4341 17.6416 64.1958 14.0878 11.6917 2.2467 7.3288 4.9923 8.9580 3.8408 6.4202 3.4216 2.9065 2.4043 5.8896 0.6584 4.8759 68.6871 3.4434 72.7826 6.3188 10.4467 26.4754 50.2409 48.7883 14.3351 103.1500 4.4425 98.2122 6.6496 24.6792 12.9688 1.2193 17.0769 0.9912 8.0214 24.9669 4.8792 14.6876 7.9537 2.7879 19.1236 6.6482 0.1001 2.6212 41.3561 0.3007 0.2565 5.3832 4.1023 0.2066 0.2500 3.7687 2.3657 13.2393 0.5978 1.9983 1.7782 8.8239 2.4860 1.3446 13.9480 40.6031 9.6934 1.0434 0.3581 3.0587 5.0008 0.8683 11.4445 15.0142 2.3237 5.4567 6.5321 2.1235 4.7308 5.1576 0.0960 1.1218 3.7022 8.7150 10.2649 24.0090 3.5851 4.7906 18.7831 266.8171 122.4559 56.7389 1.5250 5.0194 8.7549 4.7033 5.9071 28.1998 15.2855 49.9118 170.8677 32.4165 39.8382 49.9044 0.7440 4.4428 33.0436 13.2796 5.6547 10.7081 3.3748 55.6428 5.3280 17.0334 5.0716 9.2191 228.8042 92.2832 83.6918 121.2477 56.7401 9.0871 7.0272 35.4074 3.9941
temp: 298.150 k
press: 1.00000 atm
elementType: 8 8 8 6 6 6 6 6 6 6 6 6 6 6 6 6 6 6 6 6 6 1 1 1 1 1 1 1 1 1 1 1 1 1 1 1 1 1 1 1 1 1 1 1 1 1 1 1 1 1 1 1 1 1 1
symmnumber: 1
zpe: 1280719.1 jmol-1
zpe.correction: 0.487800 hartree
zpe.thermalcorrener: 0.514593 hartree
zpe.thermalcorrenthalpy: 0.515537 hartree
zpe.thermalcorrgfe: 0.425484 hartree
zpe.sumelectzpe: -930.252144 hartree
zpe.sumelectthermal: -930.225351 hartree
zpe.sumelectthermalent: -930.224407 hartree
zpe.sumelectthermalfe: -930.314460 hartree
dipole: -0.5003 -1.3980 -1.5776
dipole: 2.1664
quadrupole: -144.3888 -127.2670 -136.0676
quadrupole: -7.2203 -0.3455 -4.2409
quadrupole: -8.4810 8.6408 -0.1598 -7.2203 -0.3455 -4.2409
hfenergy: -930.7399438 hartree
pointgroup: C01[X(C18H34O3)]
dipole: -0.1673739 -0.5390896 -0.6386329 debye
polarizability: 270.4602228|-5.0589077|193.3086975|0.3312853|5.2670081|165.6986635 unknown
InChI: InChI=1S/C18H34O3/c1-2-3-4-5-8-11-14-17(19)15-12-9-6-7-10-13-16-18(20)21/h13,16-17,19-20H,2-12,14-15H2,1H3
charge 0 multiplicity 1
55 atoms
O  -4.989618 -2.832317 0.332201
O  3.912287 2.005957 -0.314471
O  3.067112 3.182556 1.507702
C  -3.82123 -2.325757 -0.427524
C  -2.502894 -2.673251 0.303447
C  -4.080213 -0.819994 -0.630841
C  -1.233761 -2.171109 -0.422378
C  0.078905 -2.563717 0.292333
C  -4.110201 0.011251 0.672017
C  1.336403 -2.008539 -0.414073
C  -4.402124 1.514692 0.434532
C  2.654555 -2.324365 0.328042
C  -3.327746 2.274768 -0.386641
C  3.902847 -1.767445 -0.393602
C  -1.931589 2.290019 0.277225
C  5.217911 -2.007319 0.38252
C  -0.885807 3.087681 -0.5553
C  6.45653 -1.442515 -0.346587
C  0.458373 3.127131 0.121158
C  1.606635 2.582973 -0.373476
C  2.870584 2.649361 0.387432
H  -3.801572 -2.812704 -1.430336
H  -2.539223 -2.263438 1.331193
H  -2.440052 -3.778457 0.41012
H  -3.311697 -0.43027 -1.326268
H  -5.054918 -0.716684 -1.147253
H  -1.217784 -2.563938 -1.461102
H  -1.271374 -1.065945 -0.509514
H  0.149319 -3.6695 0.359661
H  0.051301 -2.189778 1.337161
H  -4.8875 -0.413952 1.333643
H  -3.150275 -0.095944 1.213978
H  1.238659 -0.906868 -0.518039
H  1.388458 -2.414744 -1.44612
H  -4.517513 2.01639 1.417435
H  -5.37895 1.612096 -0.082325
H  2.756428 -3.423302 0.450942
H  2.604906 -1.899867 1.35279
H  -3.665378 3.321519 -0.533788
H  -3.245451 1.834409 -1.40104
H  3.982964 -2.230589 -1.399747
H  3.774169 -0.678113 -0.561082
H  -2.009997 2.729878 1.292545
H  -1.559445 1.256153 0.410895
H  -4.855286 -3.796695 0.516047
H  5.135113 -1.544966 1.387826
H  5.352547 -3.095236 0.552911
H  -0.800464 2.645385 -1.56626
H  -1.263495 4.124145 -0.682944
H  6.58972 -1.924723 -1.333445
H  7.382384 -1.602816 0.236251
H  6.349355 -0.354773 -0.52386
H  0.509865 3.613656 1.108097
H  1.641589 2.079903 -1.345512
H  4.746736 2.068906 0.224822
